{"text_format":"1","workbook":"xlsx","n_sheets":24,"sheets":["Version 1","Helpful Tips","^Helpful Tips","Plate 01","Plate 02","Plate 03","Plate 04","Plate 05","Plate 06","Plate 07","Plate 08","Plate 09","Plate 10","Plate 11","Plate 12","Plate 13","Plate 14","Plate 15","Plate 16","Plate 17","Plate 18","Plate 19","Plate 20","DropData"],"not_rendered":{"charts":0,"images":2,"macros":1,"external_links":1,"defined_names":386,"comments":20,"pivot_tables":0},"unopened":[],"bounds":{"document_bytes":16777216,"sheet_cells":100000,"rows_first":2000,"rows_last":500,"rows_between":2000,"halvings":0,"cell_chars":16384,"cell_head_chars":4096},"cells_cut":0,"cells_raw":0,"read":"whole","date_system":"1900"}

{"sheet":"Version 1","index":0,"n_rows":2,"n_cols":2,"rows_kept":2,"cut":false,"hidden":true,"merged":[]}
["Version 2"]
["2014-04-01","Converted form from previous upload template to xlsx format"]

{"sheet":"Helpful Tips","index":1,"n_rows":33,"n_cols":6,"rows_kept":33,"cut":false,"hidden":true,"merged":[[28,3,30,12],[32,3,34,12],[39,3,39,12],[12,3,14,12],[16,3,18,12],[20,3,22,12],[24,3,26,12]]}
[]
[]
[]
[]
[]
[null,null,null,null,"Trouble Uploading the Template?"]
[]
[null,null,null,null,"Phone Support:  ","1-800-688-2248 "]
[null,null,null,null,"Email Support:  ","dnatechsupport@eurofins.com"]
[]
[null,null,null,"Common Hiccups "]
[]
[null,null,1,"Invalid Characters: It is easy to accidentally insert invalid characters into the primer name or DNA name fields.  Acceptable characters include any letters (A-Z), numbers (0-9), and an underscore or dash."]
[]
[]
[]
[null,null,2,"Empty Wells: To leave a well empty, simply leave the cell(s) blank. Do not delete the well position. "]
[]
[]
[]
[null,null,3,"Plate Name: To name your plate, change the corresponding worksheet's name. Please note if more than one primer is used per plate, we will append a _1, _2, etc. to the end of your plate name. This will be shown in your results' file name. "]
[]
[]
[]
[null,null,4,"Plate Order: Each plate/worksheet in this template should correspond to each plate of DNA you will ship to Eurofins. We can sequence each well with up to 4 primers. Contact us if you require more than 4 reads per well. "]
[]
[]
[]
[null,null,5,"Sample Submission Guidelines: Insert a link into the webpage to go to the SSG."]
[]
[]
[]
[null,null,6,"Example: It is easy to accidentally insert invalid characters into the primer name or DNA name fields.  Acceptable characters include any letters (A-Z), numbers (0-9), and an underscore or dash."]

{"sheet":"^Helpful Tips","index":2,"n_rows":90,"n_cols":14,"rows_kept":90,"cut":false,"hidden":false,"merged":[[67,1,69,10],[71,1,76,10],[12,1,14,10],[32,1,32,5],[16,1,21,10],[55,1,62,10],[64,1,65,10],[19,0,21,0],[22,1,25,10],[27,1,30,10],[42,1,46,10],[47,1,53,10],[34,1,41,10]]}
[]
[]
[]
[]
[]
[null,null,"Trouble Uploading the Template?"]
[]
[null,null,"Phone Support:  ","1-800-688-2248 "]
[null,null,"Email Support:  ","GenomicsSupport@eurofins.com"]
[]
[null,"Common Hiccups ",null,null,null,null,null,null,null,null,null,null,"Standard Primers"]
[]
[1,"Invalid Characters: It is easy to accidentally insert invalid characters into the primer or Sample name fields.  Acceptable characters include any letters (A-Z), numbers (0-9), and an underscore or dash.",null,null,null,null,null,null,null,null,null,null,"Primer","Sequence 5' to 3' "]
[null,null,null,null,null,null,null,null,null,null,null,null,"16F","CGG TTA CCT TGT TAC GAC TT"]
[null,null,null,null,null,null,null,null,null,null,null,null,"16R","AGA GTT TGA TCC TGG CTC AG"]
[null,null,null,null,null,null,null,null,null,null,null,null,"3AOX","GCA AAT GGC ATT CTG ACA TCC"]
[2,"Primer Name is Mandatory: Please note that the e-commerce site recognizes the Primer Name column as the root, it is therefore, critical that you provide the name for the Primer (Ordered/Sent/selected from the dropdown list). The names of the ordered and sent primer are saved under my Favorite primers and you can use them for your subsequent orders based on your preferrences. Please include only a-z, A-Z, 0-9, _ characters in the primer name.",null,null,null,null,null,null,null,null,null,null,"5AOX","GAC TGG TTC CAA TTG ACA AGC"]
[null,null,null,null,null,null,null,null,null,null,null,null,"96gIII","CCC TCA TAG TTA GCG TAA CG"]
[null,null,null,null,null,null,null,null,null,null,null,null,"BGHrev","TAG AAG GCA CAG TCG AGG"]
[null,null,null,null,null,null,null,null,null,null,null,null,"CMVf","CGC AAA TGG GCG GTA GGC GTG"]
[null,null,null,null,null,null,null,null,null,null,null,null,"CYC1Reverse","GCG TGA ATG TAA GCG TGA C"]
[null,null,null,null,null,null,null,null,null,null,null,null,"EF-1aForward","TCA AGC CTC AGA CAG TGG TTC"]
[3,"Plate Name: To name your plate, change the corresponding worksheet's name. Please note if more than one primer is used per sample well, we will append a _1, _2, etc. to the end of your sample name. This will be shown in your results' file name. ",null,null,null,null,null,null,null,null,null,null,"EGFPC1F","GAT CAC TCT CGG CAT GGA C"]
[null,null,null,null,null,null,null,null,null,null,null,null,"EGFPC1R","CAT TTT ATG TTT CAG GTT CAG GG"]
[null,null,null,null,null,null,null,null,null,null,null,null,"EGFPN1F","GTC GTA ACA ACT CCG CCC"]
[null,null,null,null,null,null,null,null,null,null,null,null,"EGFPN1R","GTC CAG CTC GAC CAG GAT G"]
[null,null,null,null,null,null,null,null,null,null,null,null,"GadFor","GGG ATG TTT AAT CCA CTA C"]
[4,"Plate Order: Each plate/worksheet in this template should correspond to each plate of DNA you will ship to Eurofins. We can sequence sample in each well with up to 4 primers. Contact us if you require more than 4 reads per well. ",null,null,null,null,null,null,null,null,null,null,"GadRev","AAG AAA TTG AGA TGG TGC AC"]
[null,null,null,null,null,null,null,null,null,null,null,null,"Gal4AD","TAC CAC TAC AAT GGA TG"]
[null,null,null,null,null,null,null,null,null,null,null,null,"Gal4BD","TCA TCG GAA GAG AGT AG"]
[null,null,null,null,null,null,null,null,null,null,null,null,"GAPSEQF","GTT CGA CCC CGC CTC GAT CC"]
[5,"Sample Submission Guidelines: it explains how to achieve the best results. ",null,null,null,null,null,null,null,null,null,null,"GAPSEQR","TGA CAC ACA TTC CAC AGG GTC"]
[null,"Click here to go to the Sample Submission Guidelines",null,null,null,null,null,null,null,null,null,null,"GL2","CTT TAT GTT TTT GGC GTC TTC CA"]
[null,null,null,null,null,null,null,null,null,null,null,null,"ITS1","TCC GTA GGT GAA CCT GCG G"]
[6,"PrePaid Plates and Add. Services: Please note that add. services are restricted bases on the sample type and the prepaid services chosen by you. PCR products can be purified for a fee. This service is already included for the sample submitted in the PrePaid Plate kits_PCR. This is not available with PrePaid Plate Kit_DNA. Moreover, while you can you submit both PCR products and Plasmids in the same custom plate, i.e., Mix of DNA, additional services cannot be offered. To request for additional services, please submit a single type fo sample in each plate.",null,null,null,null,null,null,null,null,null,null,"ITS4","TCC TCC GCT TAT TGA TAT GC"]
[null,null,null,null,null,null,null,null,null,null,null,null,"M1396","TGA GTT TCG TCA CCA GTA"]
[null,null,null,null,null,null,null,null,null,null,null,null,"M13F","TGT AAA ACG ACG GCC AGT"]
[null,null,null,null,null,null,null,null,null,null,null,null,"M13F43","AGG GTT TTC CCA GTC ACG ACG TT"]
[null,null,null,null,null,null,null,null,null,null,null,null,"M13R","CAG GAA ACA GCT ATG ACC"]
[null,null,null,null,null,null,null,null,null,null,null,null,"M13R49","GAG CGG ATA ACA ATT TCA CAC AGG"]
[null,null,null,null,null,null,null,null,null,null,null,null,"malE","GGT CGT CAG ACT GTC GAT GAA GCC"]
[null,null,null,null,null,null,null,null,null,null,null,null,"mCherry-F","CCC CGT AAT GCA GAA GAA GA"]
[7,"Submitting Premixed Samples: Please note that you can submit all 'premixed' samples in one plate. You cannot submit both 'premixed' and 'templates only' (i.e., those requiring the synthesis or addition of sent/standard primer) samples in a single plate. To submit premixed samples, enter the word 'Premixed' in the Primer Name column.  ",null,null,null,null,null,null,null,null,null,null,"mCherry-R","TTG GTC ACC TTC AGC TTG G"]
[null,null,null,null,null,null,null,null,null,null,null,null,"Myc","GCA TCA ATG CAG AAG CTG ATC TCA"]
[null,null,null,null,null,null,null,null,null,null,null,null,"pBabe3","ACC CTA ACT GAC ACA CAT TCC"]
[null,null,null,null,null,null,null,null,null,null,null,null,"pBabe5","CTT TAT CCA GCC CTC AC"]
[null,null,null,null,null,null,null,null,null,null,null,null,"pBabeF","TGA CCT GGG AAG CCT TGG CT"]
[8,"Ordered Primers: You can also order custom primers. You MUST enter the name of the primer in the Primer Name columns against each well containing the same. Please also enter the sequence to synthesize in the \"Enclosed primer barcode or the Sequence to Synthesize' column. Use only standard bases, A, C, G, & T in the sequence. Please note that if you are using two different Primer Names and relevant sequences, as long as the names and sequences are cosistent across the multiple entries, only two new primers will be synthesized. ",null,null,null,null,null,null,null,null,null,null,"pBabeR","TTG CTG ACT AAT TGA GAT GCA TGC TTT"]
[null,null,null,null,null,null,null,null,null,null,null,null,"pBadF","ATG CCA TAG CAT TTT TAT CC"]
[null,null,null,null,null,null,null,null,null,null,null,null,"pBadR","GAT TTA ATC TGT ATC AGG"]
[null,null,null,null,null,null,null,null,null,null,null,null,"pcDNAF","GGC TAA CTA GAG AAC CCA CTG"]
[null,null,null,null,null,null,null,null,null,null,null,null,"pcDNAR","GGC AAC TAG AAG GCA CAG TC"]
[null,null,null,null,null,null,null,null,null,null,null,null,"petup","ATG CGT CCG GCG TAG A"]
[null,null,null,null,null,null,null,null,null,null,null,null,"pexF","GGA GCA GAC AAG CCC GTC AGG"]
[null,null,null,null,null,null,null,null,null,null,null,null,"pexR","CAG GCT TTA CAC TTT ATG CTT CCG GC"]
[9,"Enclosed/Sent Primer: To send an eclosed primer, please provide a name for the primer in the 'primer name' column and the barcode number in the 'Enclosed Primer Barcode or the Sequence to Synthesize' column. If you do not have a barcode, please make the name of the primer clear on the tube. Please do not enter the sequence of the enclosed primer in the 'Enclosed Primer Barcode or the Sequence to Synthesize' column; if you do, the primer will be synthesized and you will be charged for the same. To save the sequence for your records, you can enter the sequence in the columns to the right of the 'Template Specification' column.",null,null,null,null,null,null,null,null,null,null,"pFBACf","TCC GGA TTA TTC ATA CCG TCC C"]
[null,null,null,null,null,null,null,null,null,null,null,null,"pFBACr","CCT CTA CAA ATG TGG TAT GGC TG"]
[null,null,null,null,null,null,null,null,null,null,null,null,"pGexF","ATA GCA TGG CCT TTG CAG G"]
[null,null,null,null,null,null,null,null,null,null,null,null,"pGexR","GAG CTG CAT GTG TCA GAG G"]
[null,null,null,null,null,null,null,null,null,null,null,null,"pGL3for","CTA GCA AAA TAG GCT GTC CC"]
[null,null,null,null,null,null,null,null,null,null,null,null,"pGLfor","GTA TCT TAT GGT ACT GTA ACT G"]
[null,null,null,null,null,null,null,null,null,null,null,null,"pGLrev","CTT TAT GTT TTT GGC GTC TTC C"]
[null,null,null,null,null,null,null,null,null,null,null,null,"pJET12F","CGA CTC ACT ATA GGG AGA GCG GC"]
[null,null,null,null,null,null,null,null,null,null,null,null,"pJET12R","AAG AAC ATC GAT TTT CCA TGG CAG"]
[10,"Empty wells/Control Wells - To indicate empty wells, simply leave the sample name and primer name fields empty - do not delete the Wells. Leave the two control wells empty to allow for QC samples.",null,null,null,null,null,null,null,null,null,null,"pJET1F","GCC TGA ACA CCA TAT CCA TCC"]
[null,null,null,null,null,null,null,null,null,null,null,null,"pJET1R","GCA GCT GAG AAT ATT GTA GGA GAT C"]
[null,null,null,null,null,null,null,null,null,null,null,null,"pJETSEQF","CGA CTC ACT ATA GGG AGA GCG GC"]
[11,"Do not change column titles: Please do not edit or format the titles of the columns, since there are used in the data validation process during upload into the e-commerce site. ",null,null,null,null,null,null,null,null,null,null,"pJETSEQR","AAG AAC ATC GAT TTT CCA TGG CAG"]
[null,null,null,null,null,null,null,null,null,null,null,null,"pQEfPR","GTA TCA CGA GGC CCT TTC GTC T"]
[null,null,null,null,null,null,null,null,null,null,null,null,"pQErev","CAT TAC TGG ATC TAT CAA CAG GAG"]
[null,null,null,null,null,null,null,null,null,null,null,null,"pShCMVf","GGT CTA TAT AAG CAG AGC TG"]
[12,"Using Stored Primers: To use primers stored at our facilities for your use, you will need to use the name of the primer as stored by you in our primer management tool. Simply enter the name of your custom primer in the Primer 1 (2, 3 and 4). After you upload the excel template, please note that you can edit the primer on the final verification stage of your order. Your favorite primers will appear in the dropdown box, if you need to edit the primer. ",null,null,null,null,null,null,null,null,null,null,"pShCMVr","GTG GTA TGG CTG ATT ATG ATC AG"]
[null,null,null,null,null,null,null,null,null,null,null,null,"RV3","CTA GCA AAA TAG GCT GTC CCC"]
[null,null,null,null,null,null,null,null,null,null,null,null,"SeqL-A","TCG CGT TAA CGC TAG CAT GGA TCT C"]
[null,null,null,null,null,null,null,null,null,null,null,null,"SeqL-B","GTA ACA TCA GAG ATT TTG AGA CAC"]
[null,null,null,null,null,null,null,null,null,null,null,null,"SP6","CAT TTA GGT GAC ACT ATA G"]
[null,null,null,null,null,null,null,null,null,null,null,null,"SV40pA-R","GAA ATT TGT GAT GCT ATT GC"]
[null,null,null,null,null,null,null,null,null,null,null,null,"SV40-promoter","TAT TTA TGC AGA GGC CGA GG"]
[null,null,null,null,null,null,null,null,null,null,null,null,"T3","AAT TAA CCC TCA CTA AAG GG"]
[null,null,null,null,null,null,null,null,null,null,null,null,"T7","TAA TAC GAC TCA CTA TAG GG"]
[null,null,null,null,null,null,null,null,null,null,null,null,"T7EEV","ATG TCG TAA TAA CCC CGC CCC G"]
[null,null,null,null,null,null,null,null,null,null,null,null,"T7PCS2","TGT CTG GAT CTA CGT AAT ACG"]
[null,null,null,null,null,null,null,null,null,null,null,null,"T7term","CTA GTT ATT GCT CAG CGG T"]
[null,null,null,null,null,null,null,null,null,null,null,null,"TrcHisF","AAT CTG TGT GGG CAC TCG"]
[null,null,null,null,null,null,null,null,null,null,null,null,"TrcHisR","CTT CTG CGT TCT GAT TTA ATC TG"]
[null,null,null,null,null,null,null,null,null,null,null,null,"V1-5","GGA CTT TCC AAA ATG TCG"]
[null,null,null,null,null,null,null,null,null,null,null,null,"V5","ACC GAG GAG AGG GTT AGG GA"]
[null,null,null,null,null,null,null,null,null,null,null,null,"VF2","TGC CAC CTG ACG TCT AAG AA"]
[null,null,null,null,null,null,null,null,null,null,null,null,"VR","ATT ACC GCC TTT GAG TGA GC"]
[null,null,null,null,null,null,null,null,null,null,null,null,"XL39","ATT AGG ACA AGG CTG GTG GG"]

{"sheet":"Plate 01","index":3,"n_rows":110,"n_cols":11,"rows_kept":110,"cut":false,"hidden":false,"merged":[[1,6,1,7],[2,6,2,7],[3,6,3,7],[4,6,4,7],[109,0,112,6]]}
[]
[null,null,"Plate Information",null,null,"Tools ","Requirements"]
[null,null,"Plate Barcode:",null,null,null,"You must enter/select a primer name"]
[null,null,"*Sample Type:",null,null,"Help Page","Reserved for Control Samples"]
[null,null,"Add. Service:",null,null,null," *24 or more Samples/plate"]
[null,null,"*Advanced Options:","Standard"]
[null,null,"Template Specification:"]
[null,null,"*Plate Layout:","By Columns"]
[]
[]
[]
[null,"Well Position","*Sample Name","Primer 1","Sequence to synthesize or Barcode for enclosed primers","Primer 2","Sequence to synthesize or Barcode for enclosed primers","Primer 3","Sequence to synthesize or Barcode for enclosed primers","Primer 4","Sequence to synthesize or Barcode for enclosed primers"]
[null,"A1"]
[null,{"$f":"IF($D$8=\"By Rows\",\"A2\",\"B1\")","v":"B1"}]
[null,{"$f":"IF($D$8=\"By Rows\",\"A3\",\"C1\")","v":"C1"}]
[null,{"$f":"IF($D$8=\"By Rows\",\"A4\",\"D1\")","v":"D1"}]
[null,{"$f":"IF($D$8=\"By Rows\",\"A5\",\"E1\")","v":"E1"}]
[null,{"$f":"IF($D$8=\"By Rows\",\"A6\",\"F1\")","v":"F1"}]
[null,{"$f":"IF($D$8=\"By Rows\",\"A7\",\"G1\")","v":"G1"}]
[null,{"$f":"IF($D$8=\"By Rows\",\"A8\",\"H1\")","v":"H1"}]
[null,{"$f":"IF($D$8=\"By Rows\",\"A9\",\"A2\")","v":"A2"}]
[null,{"$f":"IF($D$8=\"By Rows\",\"A10\",\"B2\")","v":"B2"}]
[null,{"$f":"IF($D$8=\"By Rows\",\"A11\",\"C2\")","v":"C2"}]
[null,{"$f":"IF($D$8=\"By Rows\",\"A12\",\"D2\")","v":"D2"}]
[null,{"$f":"IF($D$8=\"By Rows\",\"B1\",\"E2\")","v":"E2"}]
[null,{"$f":"IF($D$8=\"By Rows\",\"B2\",\"F2\")","v":"F2"}]
[null,{"$f":"IF($D$8=\"By Rows\",\"B3\",\"G2\")","v":"G2"}]
[null,{"$f":"IF($D$8=\"By Rows\",\"B4\",\"H2\")","v":"H2"}]
[null,{"$f":"IF($D$8=\"By Rows\",\"B5\",\"A3\")","v":"A3"}]
[null,{"$f":"IF($D$8=\"By Rows\",\"B6\",\"B3\")","v":"B3"}]
[null,{"$f":"IF($D$8=\"By Rows\",\"B7\",\"C3\")","v":"C3"}]
[null,{"$f":"IF($D$8=\"By Rows\",\"B8\",\"D3\")","v":"D3"}]
[null,{"$f":"IF($D$8=\"By Rows\",\"B9\",\"E3\")","v":"E3"}]
[null,{"$f":"IF($D$8=\"By Rows\",\"B10\",\"F3\")","v":"F3"}]
[null,{"$f":"IF($D$8=\"By Rows\",\"B11\",\"G3\")","v":"G3"}]
[null,{"$f":"IF($D$8=\"By Rows\",\"B12\",\"H3\")","v":"H3"}]
[null,{"$f":"IF($D$8=\"By Rows\",\"C1\",\"A4\")","v":"A4"}]
[null,{"$f":"IF($D$8=\"By Rows\",\"C2\",\"B4\")","v":"B4"}]
[null,{"$f":"IF($D$8=\"By Rows\",\"C3\",\"C4\")","v":"C4"}]
[null,{"$f":"IF($D$8=\"By Rows\",\"C4\",\"D4\")","v":"D4"}]
[null,{"$f":"IF($D$8=\"By Rows\",\"C5\",\"E4\")","v":"E4"}]
[null,{"$f":"IF($D$8=\"By Rows\",\"C6\",\"F4\")","v":"F4"}]
[null,{"$f":"IF($D$8=\"By Rows\",\"C7\",\"G4\")","v":"G4"}]
[null,{"$f":"IF($D$8=\"By Rows\",\"C8\",\"H4\")","v":"H4"}]
[null,{"$f":"IF($D$8=\"By Rows\",\"C9\",\"A5\")","v":"A5"}]
[null,{"$f":"IF($D$8=\"By Rows\",\"C10\",\"B5\")","v":"B5"}]
[null,{"$f":"IF($D$8=\"By Rows\",\"C11\",\"C5\")","v":"C5"}]
[null,{"$f":"IF($D$8=\"By Rows\",\"C12\",\"D5\")","v":"D5"}]
[null,{"$f":"IF($D$8=\"By Rows\",\"D1\",\"E5\")","v":"E5"}]
[null,{"$f":"IF($D$8=\"By Rows\",\"D2\",\"F5\")","v":"F5"}]
[null,{"$f":"IF($D$8=\"By Rows\",\"D3\",\"G5\")","v":"G5"}]
[null,{"$f":"IF($D$8=\"By Rows\",\"D4\",\"H5\")","v":"H5"}]
[null,{"$f":"IF($D$8=\"By Rows\",\"D5\",\"A6\")","v":"A6"}]
[null,{"$f":"IF($D$8=\"By Rows\",\"D6\",\"B6\")","v":"B6"}]
[null,{"$f":"IF($D$8=\"By Rows\",\"D7\",\"C6\")","v":"C6"}]
[null,{"$f":"IF($D$8=\"By Rows\",\"D8\",\"D6\")","v":"D6"}]
[null,{"$f":"IF($D$8=\"By Rows\",\"D9\",\"E6\")","v":"E6"}]
[null,{"$f":"IF($D$8=\"By Rows\",\"D10\",\"F6\")","v":"F6"}]
[null,{"$f":"IF($D$8=\"By Rows\",\"D11\",\"G6\")","v":"G6"}]
[null,{"$f":"IF($D$8=\"By Rows\",\"D12\",\"H6\")","v":"H6"}]
[null,{"$f":"IF($D$8=\"By Rows\",\"E1\",\"A7\")","v":"A7"}]
[null,{"$f":"IF($D$8=\"By Rows\",\"E2\",\"B7\")","v":"B7"}]
[null,{"$f":"IF($D$8=\"By Rows\",\"E3\",\"C7\")","v":"C7"}]
[null,{"$f":"IF($D$8=\"By Rows\",\"E4\",\"D7\")","v":"D7"}]
[null,{"$f":"IF($D$8=\"By Rows\",\"E5\",\"E7\")","v":"E7"}]
[null,{"$f":"IF($D$8=\"By Rows\",\"E6\",\"F7\")","v":"F7"}]
[null,{"$f":"IF($D$8=\"By Rows\",\"E7\",\"G7\")","v":"G7"}]
[null,{"$f":"IF($D$8=\"By Rows\",\"E8\",\"H7\")","v":"H7"}]
[null,{"$f":"IF($D$8=\"By Rows\",\"E9\",\"A8\")","v":"A8"}]
[null,{"$f":"IF($D$8=\"By Rows\",\"E10\",\"B8\")","v":"B8"}]
[null,{"$f":"IF($D$8=\"By Rows\",\"E11\",\"C8\")","v":"C8"}]
[null,{"$f":"IF($D$8=\"By Rows\",\"E12\",\"D8\")","v":"D8"}]
[null,{"$f":"IF($D$8=\"By Rows\",\"F1\",\"E8\")","v":"E8"}]
[null,{"$f":"IF($D$8=\"By Rows\",\"F2\",\"F8\")","v":"F8"}]
[null,{"$f":"IF($D$8=\"By Rows\",\"F3\",\"G8\")","v":"G8"}]
[null,{"$f":"IF($D$8=\"By Rows\",\"F4\",\"H8\")","v":"H8"}]
[null,{"$f":"IF($D$8=\"By Rows\",\"F5\",\"A9\")","v":"A9"}]
[null,{"$f":"IF($D$8=\"By Rows\",\"F6\",\"B9\")","v":"B9"}]
[null,{"$f":"IF($D$8=\"By Rows\",\"F7\",\"C9\")","v":"C9"}]
[null,{"$f":"IF($D$8=\"By Rows\",\"F8\",\"D9\")","v":"D9"}]
[null,{"$f":"IF($D$8=\"By Rows\",\"F9\",\"E9\")","v":"E9"}]
[null,{"$f":"IF($D$8=\"By Rows\",\"F10\",\"F9\")","v":"F9"}]
[null,{"$f":"IF($D$8=\"By Rows\",\"F11\",\"G9\")","v":"G9"}]
[null,{"$f":"IF($D$8=\"By Rows\",\"F12\",\"H9\")","v":"H9"}]
[null,{"$f":"IF($D$8=\"By Rows\",\"G1\",\"A10\")","v":"A10"}]
[null,{"$f":"IF($D$8=\"By Rows\",\"G2\",\"B10\")","v":"B10"}]
[null,{"$f":"IF($D$8=\"By Rows\",\"G3\",\"C10\")","v":"C10"}]
[null,{"$f":"IF($D$8=\"By Rows\",\"G4\",\"D10\")","v":"D10"}]
[null,{"$f":"IF($D$8=\"By Rows\",\"G5\",\"E10\")","v":"E10"}]
[null,{"$f":"IF($D$8=\"By Rows\",\"G6\",\"F10\")","v":"F10"}]
[null,{"$f":"IF($D$8=\"By Rows\",\"G7\",\"G10\")","v":"G10"}]
[null,{"$f":"IF($D$8=\"By Rows\",\"G8\",\"H10\")","v":"H10"}]
[null,{"$f":"IF($D$8=\"By Rows\",\"G9\",\"A11\")","v":"A11"}]
[null,{"$f":"IF($D$8=\"By Rows\",\"G10\",\"B11\")","v":"B11"}]
[null,{"$f":"IF($D$8=\"By Rows\",\"G11\",\"C11\")","v":"C11"}]
[null,{"$f":"IF($D$8=\"By Rows\",\"G12\",\"D11\")","v":"D11"}]
[null,{"$f":"IF($D$8=\"By Rows\",\"H1\",\"E11\")","v":"E11"}]
[null,{"$f":"IF($D$8=\"By Rows\",\"H2\",\"F11\")","v":"F11"}]
[null,{"$f":"IF($D$8=\"By Rows\",\"H3\",\"G11\")","v":"G11"}]
[null,{"$f":"IF($D$8=\"By Rows\",\"H4\",\"H11\")","v":"H11"}]
[null,{"$f":"IF($D$8=\"By Rows\",\"H5\",\"A12\")","v":"A12"}]
[null,{"$f":"IF($D$8=\"By Rows\",\"H6\",\"B12\")","v":"B12"}]
[null,{"$f":"IF($D$8=\"By Rows\",\"H7\",\"C12\")","v":"C12"}]
[null,{"$f":"IF($D$8=\"By Rows\",\"H8\",\"D12\")","v":"D12"}]
[null,{"$f":"IF($D$8=\"By Rows\",\"H9\",\"E12\")","v":"E12"}]
[null,{"$f":"IF($D$8=\"By Rows\",\"H10\",\"F12\")","v":"F12"}]
[null,{"$f":"IF($D$8=\"By Rows\",\"H11\",\"G12\")","v":"G12"}]
[null,"H12"]
[]
["We strongly recommend leaving the two reserved wells empty for internal quality control purposes. However, if you include your own samples in the reserved wells as well, we will not be able to evaluate the quality of the generated sequence data.",null,null,null,null,null,null,"© Eurofins Genomics"]

{"sheet":"Plate 02","index":4,"n_rows":110,"n_cols":11,"rows_kept":110,"cut":false,"hidden":false,"merged":[[1,6,1,7],[2,6,2,7],[3,6,3,7],[4,6,4,7],[109,0,112,6]]}
[]
[null,null,"Plate Information",null,null,"Tools ","Requirements"]
[null,null,"Plate Barcode:",null,null,null,"You must enter/select a primer name"]
[null,null,"*Sample Type:",null,null,"Help Page","Reserved for Control Samples"]
[null,null,"Add. Service:",null,null,null," *24 or more Samples/plate"]
[null,null,"*Advanced Options:","Standard"]
[null,null,"Template Specification:"]
[null,null,"*Plate Layout:","By Columns"]
[]
[]
[]
[null,"Well Position","*Sample Name","Primer 1","Sequence to synthesize or Barcode for enclosed primers","Primer 2","Sequence to synthesize or Barcode for enclosed primers","Primer 3","Sequence to synthesize or Barcode for enclosed primers","Primer 4","Sequence to synthesize or Barcode for enclosed primers"]
[null,"A1"]
[null,{"$f":"IF($D$8=\"By Rows\",\"A2\",\"B1\")","v":"B1"}]
[null,{"$f":"IF($D$8=\"By Rows\",\"A3\",\"C1\")","v":"C1"}]
[null,{"$f":"IF($D$8=\"By Rows\",\"A4\",\"D1\")","v":"D1"}]
[null,{"$f":"IF($D$8=\"By Rows\",\"A5\",\"E1\")","v":"E1"}]
[null,{"$f":"IF($D$8=\"By Rows\",\"A6\",\"F1\")","v":"F1"}]
[null,{"$f":"IF($D$8=\"By Rows\",\"A7\",\"G1\")","v":"G1"}]
[null,{"$f":"IF($D$8=\"By Rows\",\"A8\",\"H1\")","v":"H1"}]
[null,{"$f":"IF($D$8=\"By Rows\",\"A9\",\"A2\")","v":"A2"}]
[null,{"$f":"IF($D$8=\"By Rows\",\"A10\",\"B2\")","v":"B2"}]
[null,{"$f":"IF($D$8=\"By Rows\",\"A11\",\"C2\")","v":"C2"}]
[null,{"$f":"IF($D$8=\"By Rows\",\"A12\",\"D2\")","v":"D2"}]
[null,{"$f":"IF($D$8=\"By Rows\",\"B1\",\"E2\")","v":"E2"}]
[null,{"$f":"IF($D$8=\"By Rows\",\"B2\",\"F2\")","v":"F2"}]
[null,{"$f":"IF($D$8=\"By Rows\",\"B3\",\"G2\")","v":"G2"}]
[null,{"$f":"IF($D$8=\"By Rows\",\"B4\",\"H2\")","v":"H2"}]
[null,{"$f":"IF($D$8=\"By Rows\",\"B5\",\"A3\")","v":"A3"}]
[null,{"$f":"IF($D$8=\"By Rows\",\"B6\",\"B3\")","v":"B3"}]
[null,{"$f":"IF($D$8=\"By Rows\",\"B7\",\"C3\")","v":"C3"}]
[null,{"$f":"IF($D$8=\"By Rows\",\"B8\",\"D3\")","v":"D3"}]
[null,{"$f":"IF($D$8=\"By Rows\",\"B9\",\"E3\")","v":"E3"}]
[null,{"$f":"IF($D$8=\"By Rows\",\"B10\",\"F3\")","v":"F3"}]
[null,{"$f":"IF($D$8=\"By Rows\",\"B11\",\"G3\")","v":"G3"}]
[null,{"$f":"IF($D$8=\"By Rows\",\"B12\",\"H3\")","v":"H3"}]
[null,{"$f":"IF($D$8=\"By Rows\",\"C1\",\"A4\")","v":"A4"}]
[null,{"$f":"IF($D$8=\"By Rows\",\"C2\",\"B4\")","v":"B4"}]
[null,{"$f":"IF($D$8=\"By Rows\",\"C3\",\"C4\")","v":"C4"}]
[null,{"$f":"IF($D$8=\"By Rows\",\"C4\",\"D4\")","v":"D4"}]
[null,{"$f":"IF($D$8=\"By Rows\",\"C5\",\"E4\")","v":"E4"}]
[null,{"$f":"IF($D$8=\"By Rows\",\"C6\",\"F4\")","v":"F4"}]
[null,{"$f":"IF($D$8=\"By Rows\",\"C7\",\"G4\")","v":"G4"}]
[null,{"$f":"IF($D$8=\"By Rows\",\"C8\",\"H4\")","v":"H4"}]
[null,{"$f":"IF($D$8=\"By Rows\",\"C9\",\"A5\")","v":"A5"}]
[null,{"$f":"IF($D$8=\"By Rows\",\"C10\",\"B5\")","v":"B5"}]
[null,{"$f":"IF($D$8=\"By Rows\",\"C11\",\"C5\")","v":"C5"}]
[null,{"$f":"IF($D$8=\"By Rows\",\"C12\",\"D5\")","v":"D5"}]
[null,{"$f":"IF($D$8=\"By Rows\",\"D1\",\"E5\")","v":"E5"}]
[null,{"$f":"IF($D$8=\"By Rows\",\"D2\",\"F5\")","v":"F5"}]
[null,{"$f":"IF($D$8=\"By Rows\",\"D3\",\"G5\")","v":"G5"}]
[null,{"$f":"IF($D$8=\"By Rows\",\"D4\",\"H5\")","v":"H5"}]
[null,{"$f":"IF($D$8=\"By Rows\",\"D5\",\"A6\")","v":"A6"}]
[null,{"$f":"IF($D$8=\"By Rows\",\"D6\",\"B6\")","v":"B6"}]
[null,{"$f":"IF($D$8=\"By Rows\",\"D7\",\"C6\")","v":"C6"}]
[null,{"$f":"IF($D$8=\"By Rows\",\"D8\",\"D6\")","v":"D6"}]
[null,{"$f":"IF($D$8=\"By Rows\",\"D9\",\"E6\")","v":"E6"}]
[null,{"$f":"IF($D$8=\"By Rows\",\"D10\",\"F6\")","v":"F6"}]
[null,{"$f":"IF($D$8=\"By Rows\",\"D11\",\"G6\")","v":"G6"}]
[null,{"$f":"IF($D$8=\"By Rows\",\"D12\",\"H6\")","v":"H6"}]
[null,{"$f":"IF($D$8=\"By Rows\",\"E1\",\"A7\")","v":"A7"}]
[null,{"$f":"IF($D$8=\"By Rows\",\"E2\",\"B7\")","v":"B7"}]
[null,{"$f":"IF($D$8=\"By Rows\",\"E3\",\"C7\")","v":"C7"}]
[null,{"$f":"IF($D$8=\"By Rows\",\"E4\",\"D7\")","v":"D7"}]
[null,{"$f":"IF($D$8=\"By Rows\",\"E5\",\"E7\")","v":"E7"}]
[null,{"$f":"IF($D$8=\"By Rows\",\"E6\",\"F7\")","v":"F7"}]
[null,{"$f":"IF($D$8=\"By Rows\",\"E7\",\"G7\")","v":"G7"}]
[null,{"$f":"IF($D$8=\"By Rows\",\"E8\",\"H7\")","v":"H7"}]
[null,{"$f":"IF($D$8=\"By Rows\",\"E9\",\"A8\")","v":"A8"}]
[null,{"$f":"IF($D$8=\"By Rows\",\"E10\",\"B8\")","v":"B8"}]
[null,{"$f":"IF($D$8=\"By Rows\",\"E11\",\"C8\")","v":"C8"}]
[null,{"$f":"IF($D$8=\"By Rows\",\"E12\",\"D8\")","v":"D8"}]
[null,{"$f":"IF($D$8=\"By Rows\",\"F1\",\"E8\")","v":"E8"}]
[null,{"$f":"IF($D$8=\"By Rows\",\"F2\",\"F8\")","v":"F8"}]
[null,{"$f":"IF($D$8=\"By Rows\",\"F3\",\"G8\")","v":"G8"}]
[null,{"$f":"IF($D$8=\"By Rows\",\"F4\",\"H8\")","v":"H8"}]
[null,{"$f":"IF($D$8=\"By Rows\",\"F5\",\"A9\")","v":"A9"}]
[null,{"$f":"IF($D$8=\"By Rows\",\"F6\",\"B9\")","v":"B9"}]
[null,{"$f":"IF($D$8=\"By Rows\",\"F7\",\"C9\")","v":"C9"}]
[null,{"$f":"IF($D$8=\"By Rows\",\"F8\",\"D9\")","v":"D9"}]
[null,{"$f":"IF($D$8=\"By Rows\",\"F9\",\"E9\")","v":"E9"}]
[null,{"$f":"IF($D$8=\"By Rows\",\"F10\",\"F9\")","v":"F9"}]
[null,{"$f":"IF($D$8=\"By Rows\",\"F11\",\"G9\")","v":"G9"}]
[null,{"$f":"IF($D$8=\"By Rows\",\"F12\",\"H9\")","v":"H9"}]
[null,{"$f":"IF($D$8=\"By Rows\",\"G1\",\"A10\")","v":"A10"}]
[null,{"$f":"IF($D$8=\"By Rows\",\"G2\",\"B10\")","v":"B10"}]
[null,{"$f":"IF($D$8=\"By Rows\",\"G3\",\"C10\")","v":"C10"}]
[null,{"$f":"IF($D$8=\"By Rows\",\"G4\",\"D10\")","v":"D10"}]
[null,{"$f":"IF($D$8=\"By Rows\",\"G5\",\"E10\")","v":"E10"}]
[null,{"$f":"IF($D$8=\"By Rows\",\"G6\",\"F10\")","v":"F10"}]
[null,{"$f":"IF($D$8=\"By Rows\",\"G7\",\"G10\")","v":"G10"}]
[null,{"$f":"IF($D$8=\"By Rows\",\"G8\",\"H10\")","v":"H10"}]
[null,{"$f":"IF($D$8=\"By Rows\",\"G9\",\"A11\")","v":"A11"}]
[null,{"$f":"IF($D$8=\"By Rows\",\"G10\",\"B11\")","v":"B11"}]
[null,{"$f":"IF($D$8=\"By Rows\",\"G11\",\"C11\")","v":"C11"}]
[null,{"$f":"IF($D$8=\"By Rows\",\"G12\",\"D11\")","v":"D11"}]
[null,{"$f":"IF($D$8=\"By Rows\",\"H1\",\"E11\")","v":"E11"}]
[null,{"$f":"IF($D$8=\"By Rows\",\"H2\",\"F11\")","v":"F11"}]
[null,{"$f":"IF($D$8=\"By Rows\",\"H3\",\"G11\")","v":"G11"}]
[null,{"$f":"IF($D$8=\"By Rows\",\"H4\",\"H11\")","v":"H11"}]
[null,{"$f":"IF($D$8=\"By Rows\",\"H5\",\"A12\")","v":"A12"}]
[null,{"$f":"IF($D$8=\"By Rows\",\"H6\",\"B12\")","v":"B12"}]
[null,{"$f":"IF($D$8=\"By Rows\",\"H7\",\"C12\")","v":"C12"}]
[null,{"$f":"IF($D$8=\"By Rows\",\"H8\",\"D12\")","v":"D12"}]
[null,{"$f":"IF($D$8=\"By Rows\",\"H9\",\"E12\")","v":"E12"}]
[null,{"$f":"IF($D$8=\"By Rows\",\"H10\",\"F12\")","v":"F12"}]
[null,{"$f":"IF($D$8=\"By Rows\",\"H11\",\"G12\")","v":"G12"}]
[null,"H12"]
[]
["We strongly recommend leaving the two reserved wells empty for internal quality control purposes. However, if you include your own samples in the reserved wells as well, we will not be able to evaluate the quality of the generated sequence data.",null,null,null,null,null,null,"© Eurofins Genomics"]

{"sheet":"Plate 03","index":5,"n_rows":110,"n_cols":11,"rows_kept":110,"cut":false,"hidden":false,"merged":[[1,6,1,7],[2,6,2,7],[3,6,3,7],[4,6,4,7],[109,0,112,6]]}
[]
[null,null,"Plate Information",null,null,"Tools ","Requirements"]
[null,null,"Plate Barcode:",null,null,null,"You must enter/select a primer name"]
[null,null,"*Sample Type:",null,null,"Help Page","Reserved for Control Samples"]
[null,null,"Add. Service:",null,null,null," *24 or more Samples/plate"]
[null,null,"*Advanced Options:","Standard"]
[null,null,"Template Specification:"]
[null,null,"*Plate Layout:","By Columns"]
[]
[]
[]
[null,"Well Position","*Sample Name","Primer 1","Sequence to synthesize or Barcode for enclosed primers","Primer 2","Sequence to synthesize or Barcode for enclosed primers","Primer 3","Sequence to synthesize or Barcode for enclosed primers","Primer 4","Sequence to synthesize or Barcode for enclosed primers"]
[null,"A1"]
[null,{"$f":"IF($D$8=\"By Rows\",\"A2\",\"B1\")","v":"B1"}]
[null,{"$f":"IF($D$8=\"By Rows\",\"A3\",\"C1\")","v":"C1"}]
[null,{"$f":"IF($D$8=\"By Rows\",\"A4\",\"D1\")","v":"D1"}]
[null,{"$f":"IF($D$8=\"By Rows\",\"A5\",\"E1\")","v":"E1"}]
[null,{"$f":"IF($D$8=\"By Rows\",\"A6\",\"F1\")","v":"F1"}]
[null,{"$f":"IF($D$8=\"By Rows\",\"A7\",\"G1\")","v":"G1"}]
[null,{"$f":"IF($D$8=\"By Rows\",\"A8\",\"H1\")","v":"H1"}]
[null,{"$f":"IF($D$8=\"By Rows\",\"A9\",\"A2\")","v":"A2"}]
[null,{"$f":"IF($D$8=\"By Rows\",\"A10\",\"B2\")","v":"B2"}]
[null,{"$f":"IF($D$8=\"By Rows\",\"A11\",\"C2\")","v":"C2"}]
[null,{"$f":"IF($D$8=\"By Rows\",\"A12\",\"D2\")","v":"D2"}]
[null,{"$f":"IF($D$8=\"By Rows\",\"B1\",\"E2\")","v":"E2"}]
[null,{"$f":"IF($D$8=\"By Rows\",\"B2\",\"F2\")","v":"F2"}]
[null,{"$f":"IF($D$8=\"By Rows\",\"B3\",\"G2\")","v":"G2"}]
[null,{"$f":"IF($D$8=\"By Rows\",\"B4\",\"H2\")","v":"H2"}]
[null,{"$f":"IF($D$8=\"By Rows\",\"B5\",\"A3\")","v":"A3"}]
[null,{"$f":"IF($D$8=\"By Rows\",\"B6\",\"B3\")","v":"B3"}]
[null,{"$f":"IF($D$8=\"By Rows\",\"B7\",\"C3\")","v":"C3"}]
[null,{"$f":"IF($D$8=\"By Rows\",\"B8\",\"D3\")","v":"D3"}]
[null,{"$f":"IF($D$8=\"By Rows\",\"B9\",\"E3\")","v":"E3"}]
[null,{"$f":"IF($D$8=\"By Rows\",\"B10\",\"F3\")","v":"F3"}]
[null,{"$f":"IF($D$8=\"By Rows\",\"B11\",\"G3\")","v":"G3"}]
[null,{"$f":"IF($D$8=\"By Rows\",\"B12\",\"H3\")","v":"H3"}]
[null,{"$f":"IF($D$8=\"By Rows\",\"C1\",\"A4\")","v":"A4"}]
[null,{"$f":"IF($D$8=\"By Rows\",\"C2\",\"B4\")","v":"B4"}]
[null,{"$f":"IF($D$8=\"By Rows\",\"C3\",\"C4\")","v":"C4"}]
[null,{"$f":"IF($D$8=\"By Rows\",\"C4\",\"D4\")","v":"D4"}]
[null,{"$f":"IF($D$8=\"By Rows\",\"C5\",\"E4\")","v":"E4"}]
[null,{"$f":"IF($D$8=\"By Rows\",\"C6\",\"F4\")","v":"F4"}]
[null,{"$f":"IF($D$8=\"By Rows\",\"C7\",\"G4\")","v":"G4"}]
[null,{"$f":"IF($D$8=\"By Rows\",\"C8\",\"H4\")","v":"H4"}]
[null,{"$f":"IF($D$8=\"By Rows\",\"C9\",\"A5\")","v":"A5"}]
[null,{"$f":"IF($D$8=\"By Rows\",\"C10\",\"B5\")","v":"B5"}]
[null,{"$f":"IF($D$8=\"By Rows\",\"C11\",\"C5\")","v":"C5"}]
[null,{"$f":"IF($D$8=\"By Rows\",\"C12\",\"D5\")","v":"D5"}]
[null,{"$f":"IF($D$8=\"By Rows\",\"D1\",\"E5\")","v":"E5"}]
[null,{"$f":"IF($D$8=\"By Rows\",\"D2\",\"F5\")","v":"F5"}]
[null,{"$f":"IF($D$8=\"By Rows\",\"D3\",\"G5\")","v":"G5"}]
[null,{"$f":"IF($D$8=\"By Rows\",\"D4\",\"H5\")","v":"H5"}]
[null,{"$f":"IF($D$8=\"By Rows\",\"D5\",\"A6\")","v":"A6"}]
[null,{"$f":"IF($D$8=\"By Rows\",\"D6\",\"B6\")","v":"B6"}]
[null,{"$f":"IF($D$8=\"By Rows\",\"D7\",\"C6\")","v":"C6"}]
[null,{"$f":"IF($D$8=\"By Rows\",\"D8\",\"D6\")","v":"D6"}]
[null,{"$f":"IF($D$8=\"By Rows\",\"D9\",\"E6\")","v":"E6"}]
[null,{"$f":"IF($D$8=\"By Rows\",\"D10\",\"F6\")","v":"F6"}]
[null,{"$f":"IF($D$8=\"By Rows\",\"D11\",\"G6\")","v":"G6"}]
[null,{"$f":"IF($D$8=\"By Rows\",\"D12\",\"H6\")","v":"H6"}]
[null,{"$f":"IF($D$8=\"By Rows\",\"E1\",\"A7\")","v":"A7"}]
[null,{"$f":"IF($D$8=\"By Rows\",\"E2\",\"B7\")","v":"B7"}]
[null,{"$f":"IF($D$8=\"By Rows\",\"E3\",\"C7\")","v":"C7"}]
[null,{"$f":"IF($D$8=\"By Rows\",\"E4\",\"D7\")","v":"D7"}]
[null,{"$f":"IF($D$8=\"By Rows\",\"E5\",\"E7\")","v":"E7"}]
[null,{"$f":"IF($D$8=\"By Rows\",\"E6\",\"F7\")","v":"F7"}]
[null,{"$f":"IF($D$8=\"By Rows\",\"E7\",\"G7\")","v":"G7"}]
[null,{"$f":"IF($D$8=\"By Rows\",\"E8\",\"H7\")","v":"H7"}]
[null,{"$f":"IF($D$8=\"By Rows\",\"E9\",\"A8\")","v":"A8"}]
[null,{"$f":"IF($D$8=\"By Rows\",\"E10\",\"B8\")","v":"B8"}]
[null,{"$f":"IF($D$8=\"By Rows\",\"E11\",\"C8\")","v":"C8"}]
[null,{"$f":"IF($D$8=\"By Rows\",\"E12\",\"D8\")","v":"D8"}]
[null,{"$f":"IF($D$8=\"By Rows\",\"F1\",\"E8\")","v":"E8"}]
[null,{"$f":"IF($D$8=\"By Rows\",\"F2\",\"F8\")","v":"F8"}]
[null,{"$f":"IF($D$8=\"By Rows\",\"F3\",\"G8\")","v":"G8"}]
[null,{"$f":"IF($D$8=\"By Rows\",\"F4\",\"H8\")","v":"H8"}]
[null,{"$f":"IF($D$8=\"By Rows\",\"F5\",\"A9\")","v":"A9"}]
[null,{"$f":"IF($D$8=\"By Rows\",\"F6\",\"B9\")","v":"B9"}]
[null,{"$f":"IF($D$8=\"By Rows\",\"F7\",\"C9\")","v":"C9"}]
[null,{"$f":"IF($D$8=\"By Rows\",\"F8\",\"D9\")","v":"D9"}]
[null,{"$f":"IF($D$8=\"By Rows\",\"F9\",\"E9\")","v":"E9"}]
[null,{"$f":"IF($D$8=\"By Rows\",\"F10\",\"F9\")","v":"F9"}]
[null,{"$f":"IF($D$8=\"By Rows\",\"F11\",\"G9\")","v":"G9"}]
[null,{"$f":"IF($D$8=\"By Rows\",\"F12\",\"H9\")","v":"H9"}]
[null,{"$f":"IF($D$8=\"By Rows\",\"G1\",\"A10\")","v":"A10"}]
[null,{"$f":"IF($D$8=\"By Rows\",\"G2\",\"B10\")","v":"B10"}]
[null,{"$f":"IF($D$8=\"By Rows\",\"G3\",\"C10\")","v":"C10"}]
[null,{"$f":"IF($D$8=\"By Rows\",\"G4\",\"D10\")","v":"D10"}]
[null,{"$f":"IF($D$8=\"By Rows\",\"G5\",\"E10\")","v":"E10"}]
[null,{"$f":"IF($D$8=\"By Rows\",\"G6\",\"F10\")","v":"F10"}]
[null,{"$f":"IF($D$8=\"By Rows\",\"G7\",\"G10\")","v":"G10"}]
[null,{"$f":"IF($D$8=\"By Rows\",\"G8\",\"H10\")","v":"H10"}]
[null,{"$f":"IF($D$8=\"By Rows\",\"G9\",\"A11\")","v":"A11"}]
[null,{"$f":"IF($D$8=\"By Rows\",\"G10\",\"B11\")","v":"B11"}]
[null,{"$f":"IF($D$8=\"By Rows\",\"G11\",\"C11\")","v":"C11"}]
[null,{"$f":"IF($D$8=\"By Rows\",\"G12\",\"D11\")","v":"D11"}]
[null,{"$f":"IF($D$8=\"By Rows\",\"H1\",\"E11\")","v":"E11"}]
[null,{"$f":"IF($D$8=\"By Rows\",\"H2\",\"F11\")","v":"F11"}]
[null,{"$f":"IF($D$8=\"By Rows\",\"H3\",\"G11\")","v":"G11"}]
[null,{"$f":"IF($D$8=\"By Rows\",\"H4\",\"H11\")","v":"H11"}]
[null,{"$f":"IF($D$8=\"By Rows\",\"H5\",\"A12\")","v":"A12"}]
[null,{"$f":"IF($D$8=\"By Rows\",\"H6\",\"B12\")","v":"B12"}]
[null,{"$f":"IF($D$8=\"By Rows\",\"H7\",\"C12\")","v":"C12"}]
[null,{"$f":"IF($D$8=\"By Rows\",\"H8\",\"D12\")","v":"D12"}]
[null,{"$f":"IF($D$8=\"By Rows\",\"H9\",\"E12\")","v":"E12"}]
[null,{"$f":"IF($D$8=\"By Rows\",\"H10\",\"F12\")","v":"F12"}]
[null,{"$f":"IF($D$8=\"By Rows\",\"H11\",\"G12\")","v":"G12"}]
[null,"H12"]
[]
["We strongly recommend leaving the two reserved wells empty for internal quality control purposes. However, if you include your own samples in the reserved wells as well, we will not be able to evaluate the quality of the generated sequence data.",null,null,null,null,null,null,"© Eurofins Genomics"]

{"sheet":"Plate 04","index":6,"n_rows":110,"n_cols":11,"rows_kept":110,"cut":false,"hidden":false,"merged":[[1,6,1,7],[2,6,2,7],[3,6,3,7],[4,6,4,7],[109,0,112,6]]}
[]
[null,null,"Plate Information",null,null,"Tools ","Requirements"]
[null,null,"Plate Barcode:",null,null,null,"You must enter/select a primer name"]
[null,null,"*Sample Type:",null,null,"Help Page","Reserved for Control Samples"]
[null,null,"Add. Service:",null,null,null," *24 or more Samples/plate"]
[null,null,"*Advanced Options:","Standard"]
[null,null,"Template Specification:"]
[null,null,"*Plate Layout:","By Columns"]
[]
[]
[]
[null,"Well Position","*Sample Name","Primer 1","Sequence to synthesize or Barcode for enclosed primers","Primer 2","Sequence to synthesize or Barcode for enclosed primers","Primer 3","Sequence to synthesize or Barcode for enclosed primers","Primer 4","Sequence to synthesize or Barcode for enclosed primers"]
[null,"A1"]
[null,{"$f":"IF($D$8=\"By Rows\",\"A2\",\"B1\")","v":"B1"}]
[null,{"$f":"IF($D$8=\"By Rows\",\"A3\",\"C1\")","v":"C1"}]
[null,{"$f":"IF($D$8=\"By Rows\",\"A4\",\"D1\")","v":"D1"}]
[null,{"$f":"IF($D$8=\"By Rows\",\"A5\",\"E1\")","v":"E1"}]
[null,{"$f":"IF($D$8=\"By Rows\",\"A6\",\"F1\")","v":"F1"}]
[null,{"$f":"IF($D$8=\"By Rows\",\"A7\",\"G1\")","v":"G1"}]
[null,{"$f":"IF($D$8=\"By Rows\",\"A8\",\"H1\")","v":"H1"}]
[null,{"$f":"IF($D$8=\"By Rows\",\"A9\",\"A2\")","v":"A2"}]
[null,{"$f":"IF($D$8=\"By Rows\",\"A10\",\"B2\")","v":"B2"}]
[null,{"$f":"IF($D$8=\"By Rows\",\"A11\",\"C2\")","v":"C2"}]
[null,{"$f":"IF($D$8=\"By Rows\",\"A12\",\"D2\")","v":"D2"}]
[null,{"$f":"IF($D$8=\"By Rows\",\"B1\",\"E2\")","v":"E2"}]
[null,{"$f":"IF($D$8=\"By Rows\",\"B2\",\"F2\")","v":"F2"}]
[null,{"$f":"IF($D$8=\"By Rows\",\"B3\",\"G2\")","v":"G2"}]
[null,{"$f":"IF($D$8=\"By Rows\",\"B4\",\"H2\")","v":"H2"}]
[null,{"$f":"IF($D$8=\"By Rows\",\"B5\",\"A3\")","v":"A3"}]
[null,{"$f":"IF($D$8=\"By Rows\",\"B6\",\"B3\")","v":"B3"}]
[null,{"$f":"IF($D$8=\"By Rows\",\"B7\",\"C3\")","v":"C3"}]
[null,{"$f":"IF($D$8=\"By Rows\",\"B8\",\"D3\")","v":"D3"}]
[null,{"$f":"IF($D$8=\"By Rows\",\"B9\",\"E3\")","v":"E3"}]
[null,{"$f":"IF($D$8=\"By Rows\",\"B10\",\"F3\")","v":"F3"}]
[null,{"$f":"IF($D$8=\"By Rows\",\"B11\",\"G3\")","v":"G3"}]
[null,{"$f":"IF($D$8=\"By Rows\",\"B12\",\"H3\")","v":"H3"}]
[null,{"$f":"IF($D$8=\"By Rows\",\"C1\",\"A4\")","v":"A4"}]
[null,{"$f":"IF($D$8=\"By Rows\",\"C2\",\"B4\")","v":"B4"}]
[null,{"$f":"IF($D$8=\"By Rows\",\"C3\",\"C4\")","v":"C4"}]
[null,{"$f":"IF($D$8=\"By Rows\",\"C4\",\"D4\")","v":"D4"}]
[null,{"$f":"IF($D$8=\"By Rows\",\"C5\",\"E4\")","v":"E4"}]
[null,{"$f":"IF($D$8=\"By Rows\",\"C6\",\"F4\")","v":"F4"}]
[null,{"$f":"IF($D$8=\"By Rows\",\"C7\",\"G4\")","v":"G4"}]
[null,{"$f":"IF($D$8=\"By Rows\",\"C8\",\"H4\")","v":"H4"}]
[null,{"$f":"IF($D$8=\"By Rows\",\"C9\",\"A5\")","v":"A5"}]
[null,{"$f":"IF($D$8=\"By Rows\",\"C10\",\"B5\")","v":"B5"}]
[null,{"$f":"IF($D$8=\"By Rows\",\"C11\",\"C5\")","v":"C5"}]
[null,{"$f":"IF($D$8=\"By Rows\",\"C12\",\"D5\")","v":"D5"}]
[null,{"$f":"IF($D$8=\"By Rows\",\"D1\",\"E5\")","v":"E5"}]
[null,{"$f":"IF($D$8=\"By Rows\",\"D2\",\"F5\")","v":"F5"}]
[null,{"$f":"IF($D$8=\"By Rows\",\"D3\",\"G5\")","v":"G5"}]
[null,{"$f":"IF($D$8=\"By Rows\",\"D4\",\"H5\")","v":"H5"}]
[null,{"$f":"IF($D$8=\"By Rows\",\"D5\",\"A6\")","v":"A6"}]
[null,{"$f":"IF($D$8=\"By Rows\",\"D6\",\"B6\")","v":"B6"}]
[null,{"$f":"IF($D$8=\"By Rows\",\"D7\",\"C6\")","v":"C6"}]
[null,{"$f":"IF($D$8=\"By Rows\",\"D8\",\"D6\")","v":"D6"}]
[null,{"$f":"IF($D$8=\"By Rows\",\"D9\",\"E6\")","v":"E6"}]
[null,{"$f":"IF($D$8=\"By Rows\",\"D10\",\"F6\")","v":"F6"}]
[null,{"$f":"IF($D$8=\"By Rows\",\"D11\",\"G6\")","v":"G6"}]
[null,{"$f":"IF($D$8=\"By Rows\",\"D12\",\"H6\")","v":"H6"}]
[null,{"$f":"IF($D$8=\"By Rows\",\"E1\",\"A7\")","v":"A7"}]
[null,{"$f":"IF($D$8=\"By Rows\",\"E2\",\"B7\")","v":"B7"}]
[null,{"$f":"IF($D$8=\"By Rows\",\"E3\",\"C7\")","v":"C7"}]
[null,{"$f":"IF($D$8=\"By Rows\",\"E4\",\"D7\")","v":"D7"}]
[null,{"$f":"IF($D$8=\"By Rows\",\"E5\",\"E7\")","v":"E7"}]
[null,{"$f":"IF($D$8=\"By Rows\",\"E6\",\"F7\")","v":"F7"}]
[null,{"$f":"IF($D$8=\"By Rows\",\"E7\",\"G7\")","v":"G7"}]
[null,{"$f":"IF($D$8=\"By Rows\",\"E8\",\"H7\")","v":"H7"}]
[null,{"$f":"IF($D$8=\"By Rows\",\"E9\",\"A8\")","v":"A8"}]
[null,{"$f":"IF($D$8=\"By Rows\",\"E10\",\"B8\")","v":"B8"}]
[null,{"$f":"IF($D$8=\"By Rows\",\"E11\",\"C8\")","v":"C8"}]
[null,{"$f":"IF($D$8=\"By Rows\",\"E12\",\"D8\")","v":"D8"}]
[null,{"$f":"IF($D$8=\"By Rows\",\"F1\",\"E8\")","v":"E8"}]
[null,{"$f":"IF($D$8=\"By Rows\",\"F2\",\"F8\")","v":"F8"}]
[null,{"$f":"IF($D$8=\"By Rows\",\"F3\",\"G8\")","v":"G8"}]
[null,{"$f":"IF($D$8=\"By Rows\",\"F4\",\"H8\")","v":"H8"}]
[null,{"$f":"IF($D$8=\"By Rows\",\"F5\",\"A9\")","v":"A9"}]
[null,{"$f":"IF($D$8=\"By Rows\",\"F6\",\"B9\")","v":"B9"}]
[null,{"$f":"IF($D$8=\"By Rows\",\"F7\",\"C9\")","v":"C9"}]
[null,{"$f":"IF($D$8=\"By Rows\",\"F8\",\"D9\")","v":"D9"}]
[null,{"$f":"IF($D$8=\"By Rows\",\"F9\",\"E9\")","v":"E9"}]
[null,{"$f":"IF($D$8=\"By Rows\",\"F10\",\"F9\")","v":"F9"}]
[null,{"$f":"IF($D$8=\"By Rows\",\"F11\",\"G9\")","v":"G9"}]
[null,{"$f":"IF($D$8=\"By Rows\",\"F12\",\"H9\")","v":"H9"}]
[null,{"$f":"IF($D$8=\"By Rows\",\"G1\",\"A10\")","v":"A10"}]
[null,{"$f":"IF($D$8=\"By Rows\",\"G2\",\"B10\")","v":"B10"}]
[null,{"$f":"IF($D$8=\"By Rows\",\"G3\",\"C10\")","v":"C10"}]
[null,{"$f":"IF($D$8=\"By Rows\",\"G4\",\"D10\")","v":"D10"}]
[null,{"$f":"IF($D$8=\"By Rows\",\"G5\",\"E10\")","v":"E10"}]
[null,{"$f":"IF($D$8=\"By Rows\",\"G6\",\"F10\")","v":"F10"}]
[null,{"$f":"IF($D$8=\"By Rows\",\"G7\",\"G10\")","v":"G10"}]
[null,{"$f":"IF($D$8=\"By Rows\",\"G8\",\"H10\")","v":"H10"}]
[null,{"$f":"IF($D$8=\"By Rows\",\"G9\",\"A11\")","v":"A11"}]
[null,{"$f":"IF($D$8=\"By Rows\",\"G10\",\"B11\")","v":"B11"}]
[null,{"$f":"IF($D$8=\"By Rows\",\"G11\",\"C11\")","v":"C11"}]
[null,{"$f":"IF($D$8=\"By Rows\",\"G12\",\"D11\")","v":"D11"}]
[null,{"$f":"IF($D$8=\"By Rows\",\"H1\",\"E11\")","v":"E11"}]
[null,{"$f":"IF($D$8=\"By Rows\",\"H2\",\"F11\")","v":"F11"}]
[null,{"$f":"IF($D$8=\"By Rows\",\"H3\",\"G11\")","v":"G11"}]
[null,{"$f":"IF($D$8=\"By Rows\",\"H4\",\"H11\")","v":"H11"}]
[null,{"$f":"IF($D$8=\"By Rows\",\"H5\",\"A12\")","v":"A12"}]
[null,{"$f":"IF($D$8=\"By Rows\",\"H6\",\"B12\")","v":"B12"}]
[null,{"$f":"IF($D$8=\"By Rows\",\"H7\",\"C12\")","v":"C12"}]
[null,{"$f":"IF($D$8=\"By Rows\",\"H8\",\"D12\")","v":"D12"}]
[null,{"$f":"IF($D$8=\"By Rows\",\"H9\",\"E12\")","v":"E12"}]
[null,{"$f":"IF($D$8=\"By Rows\",\"H10\",\"F12\")","v":"F12"}]
[null,{"$f":"IF($D$8=\"By Rows\",\"H11\",\"G12\")","v":"G12"}]
[null,"H12"]
[]
["We strongly recommend leaving the two reserved wells empty for internal quality control purposes. However, if you include your own samples in the reserved wells as well, we will not be able to evaluate the quality of the generated sequence data.",null,null,null,null,null,null,"© Eurofins Genomics"]

{"sheet":"Plate 05","index":7,"n_rows":110,"n_cols":11,"rows_kept":110,"cut":false,"hidden":false,"merged":[[1,6,1,7],[2,6,2,7],[3,6,3,7],[4,6,4,7],[109,0,112,6]]}
[]
[null,null,"Plate Information",null,null,"Tools ","Requirements"]
[null,null,"Plate Barcode:",null,null,null,"You must enter/select a primer name"]
[null,null,"*Sample Type:",null,null,"Help Page","Reserved for Control Samples"]
[null,null,"Add. Service:",null,null,null," *24 or more Samples/plate"]
[null,null,"*Advanced Options:","Standard"]
[null,null,"Template Specification:"]
[null,null,"*Plate Layout:","By Columns"]
[]
[]
[]
[null,"Well Position","*Sample Name","Primer 1","Sequence to synthesize or Barcode for enclosed primers","Primer 2","Sequence to synthesize or Barcode for enclosed primers","Primer 3","Sequence to synthesize or Barcode for enclosed primers","Primer 4","Sequence to synthesize or Barcode for enclosed primers"]
[null,"A1"]
[null,{"$f":"IF($D$8=\"By Rows\",\"A2\",\"B1\")","v":"B1"}]
[null,{"$f":"IF($D$8=\"By Rows\",\"A3\",\"C1\")","v":"C1"}]
[null,{"$f":"IF($D$8=\"By Rows\",\"A4\",\"D1\")","v":"D1"}]
[null,{"$f":"IF($D$8=\"By Rows\",\"A5\",\"E1\")","v":"E1"}]
[null,{"$f":"IF($D$8=\"By Rows\",\"A6\",\"F1\")","v":"F1"}]
[null,{"$f":"IF($D$8=\"By Rows\",\"A7\",\"G1\")","v":"G1"}]
[null,{"$f":"IF($D$8=\"By Rows\",\"A8\",\"H1\")","v":"H1"}]
[null,{"$f":"IF($D$8=\"By Rows\",\"A9\",\"A2\")","v":"A2"}]
[null,{"$f":"IF($D$8=\"By Rows\",\"A10\",\"B2\")","v":"B2"}]
[null,{"$f":"IF($D$8=\"By Rows\",\"A11\",\"C2\")","v":"C2"}]
[null,{"$f":"IF($D$8=\"By Rows\",\"A12\",\"D2\")","v":"D2"}]
[null,{"$f":"IF($D$8=\"By Rows\",\"B1\",\"E2\")","v":"E2"}]
[null,{"$f":"IF($D$8=\"By Rows\",\"B2\",\"F2\")","v":"F2"}]
[null,{"$f":"IF($D$8=\"By Rows\",\"B3\",\"G2\")","v":"G2"}]
[null,{"$f":"IF($D$8=\"By Rows\",\"B4\",\"H2\")","v":"H2"}]
[null,{"$f":"IF($D$8=\"By Rows\",\"B5\",\"A3\")","v":"A3"}]
[null,{"$f":"IF($D$8=\"By Rows\",\"B6\",\"B3\")","v":"B3"}]
[null,{"$f":"IF($D$8=\"By Rows\",\"B7\",\"C3\")","v":"C3"}]
[null,{"$f":"IF($D$8=\"By Rows\",\"B8\",\"D3\")","v":"D3"}]
[null,{"$f":"IF($D$8=\"By Rows\",\"B9\",\"E3\")","v":"E3"}]
[null,{"$f":"IF($D$8=\"By Rows\",\"B10\",\"F3\")","v":"F3"}]
[null,{"$f":"IF($D$8=\"By Rows\",\"B11\",\"G3\")","v":"G3"}]
[null,{"$f":"IF($D$8=\"By Rows\",\"B12\",\"H3\")","v":"H3"}]
[null,{"$f":"IF($D$8=\"By Rows\",\"C1\",\"A4\")","v":"A4"}]
[null,{"$f":"IF($D$8=\"By Rows\",\"C2\",\"B4\")","v":"B4"}]
[null,{"$f":"IF($D$8=\"By Rows\",\"C3\",\"C4\")","v":"C4"}]
[null,{"$f":"IF($D$8=\"By Rows\",\"C4\",\"D4\")","v":"D4"}]
[null,{"$f":"IF($D$8=\"By Rows\",\"C5\",\"E4\")","v":"E4"}]
[null,{"$f":"IF($D$8=\"By Rows\",\"C6\",\"F4\")","v":"F4"}]
[null,{"$f":"IF($D$8=\"By Rows\",\"C7\",\"G4\")","v":"G4"}]
[null,{"$f":"IF($D$8=\"By Rows\",\"C8\",\"H4\")","v":"H4"}]
[null,{"$f":"IF($D$8=\"By Rows\",\"C9\",\"A5\")","v":"A5"}]
[null,{"$f":"IF($D$8=\"By Rows\",\"C10\",\"B5\")","v":"B5"}]
[null,{"$f":"IF($D$8=\"By Rows\",\"C11\",\"C5\")","v":"C5"}]
[null,{"$f":"IF($D$8=\"By Rows\",\"C12\",\"D5\")","v":"D5"}]
[null,{"$f":"IF($D$8=\"By Rows\",\"D1\",\"E5\")","v":"E5"}]
[null,{"$f":"IF($D$8=\"By Rows\",\"D2\",\"F5\")","v":"F5"}]
[null,{"$f":"IF($D$8=\"By Rows\",\"D3\",\"G5\")","v":"G5"}]
[null,{"$f":"IF($D$8=\"By Rows\",\"D4\",\"H5\")","v":"H5"}]
[null,{"$f":"IF($D$8=\"By Rows\",\"D5\",\"A6\")","v":"A6"}]
[null,{"$f":"IF($D$8=\"By Rows\",\"D6\",\"B6\")","v":"B6"}]
[null,{"$f":"IF($D$8=\"By Rows\",\"D7\",\"C6\")","v":"C6"}]
[null,{"$f":"IF($D$8=\"By Rows\",\"D8\",\"D6\")","v":"D6"}]
[null,{"$f":"IF($D$8=\"By Rows\",\"D9\",\"E6\")","v":"E6"}]
[null,{"$f":"IF($D$8=\"By Rows\",\"D10\",\"F6\")","v":"F6"}]
[null,{"$f":"IF($D$8=\"By Rows\",\"D11\",\"G6\")","v":"G6"}]
[null,{"$f":"IF($D$8=\"By Rows\",\"D12\",\"H6\")","v":"H6"}]
[null,{"$f":"IF($D$8=\"By Rows\",\"E1\",\"A7\")","v":"A7"}]
[null,{"$f":"IF($D$8=\"By Rows\",\"E2\",\"B7\")","v":"B7"}]
[null,{"$f":"IF($D$8=\"By Rows\",\"E3\",\"C7\")","v":"C7"}]
[null,{"$f":"IF($D$8=\"By Rows\",\"E4\",\"D7\")","v":"D7"}]
[null,{"$f":"IF($D$8=\"By Rows\",\"E5\",\"E7\")","v":"E7"}]
[null,{"$f":"IF($D$8=\"By Rows\",\"E6\",\"F7\")","v":"F7"}]
[null,{"$f":"IF($D$8=\"By Rows\",\"E7\",\"G7\")","v":"G7"}]
[null,{"$f":"IF($D$8=\"By Rows\",\"E8\",\"H7\")","v":"H7"}]
[null,{"$f":"IF($D$8=\"By Rows\",\"E9\",\"A8\")","v":"A8"}]
[null,{"$f":"IF($D$8=\"By Rows\",\"E10\",\"B8\")","v":"B8"}]
[null,{"$f":"IF($D$8=\"By Rows\",\"E11\",\"C8\")","v":"C8"}]
[null,{"$f":"IF($D$8=\"By Rows\",\"E12\",\"D8\")","v":"D8"}]
[null,{"$f":"IF($D$8=\"By Rows\",\"F1\",\"E8\")","v":"E8"}]
[null,{"$f":"IF($D$8=\"By Rows\",\"F2\",\"F8\")","v":"F8"}]
[null,{"$f":"IF($D$8=\"By Rows\",\"F3\",\"G8\")","v":"G8"}]
[null,{"$f":"IF($D$8=\"By Rows\",\"F4\",\"H8\")","v":"H8"}]
[null,{"$f":"IF($D$8=\"By Rows\",\"F5\",\"A9\")","v":"A9"}]
[null,{"$f":"IF($D$8=\"By Rows\",\"F6\",\"B9\")","v":"B9"}]
[null,{"$f":"IF($D$8=\"By Rows\",\"F7\",\"C9\")","v":"C9"}]
[null,{"$f":"IF($D$8=\"By Rows\",\"F8\",\"D9\")","v":"D9"}]
[null,{"$f":"IF($D$8=\"By Rows\",\"F9\",\"E9\")","v":"E9"}]
[null,{"$f":"IF($D$8=\"By Rows\",\"F10\",\"F9\")","v":"F9"}]
[null,{"$f":"IF($D$8=\"By Rows\",\"F11\",\"G9\")","v":"G9"}]
[null,{"$f":"IF($D$8=\"By Rows\",\"F12\",\"H9\")","v":"H9"}]
[null,{"$f":"IF($D$8=\"By Rows\",\"G1\",\"A10\")","v":"A10"}]
[null,{"$f":"IF($D$8=\"By Rows\",\"G2\",\"B10\")","v":"B10"}]
[null,{"$f":"IF($D$8=\"By Rows\",\"G3\",\"C10\")","v":"C10"}]
[null,{"$f":"IF($D$8=\"By Rows\",\"G4\",\"D10\")","v":"D10"}]
[null,{"$f":"IF($D$8=\"By Rows\",\"G5\",\"E10\")","v":"E10"}]
[null,{"$f":"IF($D$8=\"By Rows\",\"G6\",\"F10\")","v":"F10"}]
[null,{"$f":"IF($D$8=\"By Rows\",\"G7\",\"G10\")","v":"G10"}]
[null,{"$f":"IF($D$8=\"By Rows\",\"G8\",\"H10\")","v":"H10"}]
[null,{"$f":"IF($D$8=\"By Rows\",\"G9\",\"A11\")","v":"A11"}]
[null,{"$f":"IF($D$8=\"By Rows\",\"G10\",\"B11\")","v":"B11"}]
[null,{"$f":"IF($D$8=\"By Rows\",\"G11\",\"C11\")","v":"C11"}]
[null,{"$f":"IF($D$8=\"By Rows\",\"G12\",\"D11\")","v":"D11"}]
[null,{"$f":"IF($D$8=\"By Rows\",\"H1\",\"E11\")","v":"E11"}]
[null,{"$f":"IF($D$8=\"By Rows\",\"H2\",\"F11\")","v":"F11"}]
[null,{"$f":"IF($D$8=\"By Rows\",\"H3\",\"G11\")","v":"G11"}]
[null,{"$f":"IF($D$8=\"By Rows\",\"H4\",\"H11\")","v":"H11"}]
[null,{"$f":"IF($D$8=\"By Rows\",\"H5\",\"A12\")","v":"A12"}]
[null,{"$f":"IF($D$8=\"By Rows\",\"H6\",\"B12\")","v":"B12"}]
[null,{"$f":"IF($D$8=\"By Rows\",\"H7\",\"C12\")","v":"C12"}]
[null,{"$f":"IF($D$8=\"By Rows\",\"H8\",\"D12\")","v":"D12"}]
[null,{"$f":"IF($D$8=\"By Rows\",\"H9\",\"E12\")","v":"E12"}]
[null,{"$f":"IF($D$8=\"By Rows\",\"H10\",\"F12\")","v":"F12"}]
[null,{"$f":"IF($D$8=\"By Rows\",\"H11\",\"G12\")","v":"G12"}]
[null,"H12"]
[]
["We strongly recommend leaving the two reserved wells empty for internal quality control purposes. However, if you include your own samples in the reserved wells as well, we will not be able to evaluate the quality of the generated sequence data.",null,null,null,null,null,null,"© Eurofins Genomics"]

{"sheet":"Plate 06","index":8,"n_rows":110,"n_cols":11,"rows_kept":110,"cut":false,"hidden":false,"merged":[[1,6,1,7],[2,6,2,7],[3,6,3,7],[4,6,4,7],[109,0,112,6]]}
[]
[null,null,"Plate Information",null,null,"Tools ","Requirements"]
[null,null,"Plate Barcode:",null,null,null,"You must enter/select a primer name"]
[null,null,"*Sample Type:",null,null,"Help Page","Reserved for Control Samples"]
[null,null,"Add. Service:",null,null,null," *24 or more Samples/plate"]
[null,null,"*Advanced Options:","Standard"]
[null,null,"Template Specification:"]
[null,null,"*Plate Layout:","By Columns"]
[]
[]
[]
[null,"Well Position","*Sample Name","Primer 1","Sequence to synthesize or Barcode for enclosed primers","Primer 2","Sequence to synthesize or Barcode for enclosed primers","Primer 3","Sequence to synthesize or Barcode for enclosed primers","Primer 4","Sequence to synthesize or Barcode for enclosed primers"]
[null,"A1"]
[null,{"$f":"IF($D$8=\"By Rows\",\"A2\",\"B1\")","v":"B1"}]
[null,{"$f":"IF($D$8=\"By Rows\",\"A3\",\"C1\")","v":"C1"}]
[null,{"$f":"IF($D$8=\"By Rows\",\"A4\",\"D1\")","v":"D1"}]
[null,{"$f":"IF($D$8=\"By Rows\",\"A5\",\"E1\")","v":"E1"}]
[null,{"$f":"IF($D$8=\"By Rows\",\"A6\",\"F1\")","v":"F1"}]
[null,{"$f":"IF($D$8=\"By Rows\",\"A7\",\"G1\")","v":"G1"}]
[null,{"$f":"IF($D$8=\"By Rows\",\"A8\",\"H1\")","v":"H1"}]
[null,{"$f":"IF($D$8=\"By Rows\",\"A9\",\"A2\")","v":"A2"}]
[null,{"$f":"IF($D$8=\"By Rows\",\"A10\",\"B2\")","v":"B2"}]
[null,{"$f":"IF($D$8=\"By Rows\",\"A11\",\"C2\")","v":"C2"}]
[null,{"$f":"IF($D$8=\"By Rows\",\"A12\",\"D2\")","v":"D2"}]
[null,{"$f":"IF($D$8=\"By Rows\",\"B1\",\"E2\")","v":"E2"}]
[null,{"$f":"IF($D$8=\"By Rows\",\"B2\",\"F2\")","v":"F2"}]
[null,{"$f":"IF($D$8=\"By Rows\",\"B3\",\"G2\")","v":"G2"}]
[null,{"$f":"IF($D$8=\"By Rows\",\"B4\",\"H2\")","v":"H2"}]
[null,{"$f":"IF($D$8=\"By Rows\",\"B5\",\"A3\")","v":"A3"}]
[null,{"$f":"IF($D$8=\"By Rows\",\"B6\",\"B3\")","v":"B3"}]
[null,{"$f":"IF($D$8=\"By Rows\",\"B7\",\"C3\")","v":"C3"}]
[null,{"$f":"IF($D$8=\"By Rows\",\"B8\",\"D3\")","v":"D3"}]
[null,{"$f":"IF($D$8=\"By Rows\",\"B9\",\"E3\")","v":"E3"}]
[null,{"$f":"IF($D$8=\"By Rows\",\"B10\",\"F3\")","v":"F3"}]
[null,{"$f":"IF($D$8=\"By Rows\",\"B11\",\"G3\")","v":"G3"}]
[null,{"$f":"IF($D$8=\"By Rows\",\"B12\",\"H3\")","v":"H3"}]
[null,{"$f":"IF($D$8=\"By Rows\",\"C1\",\"A4\")","v":"A4"}]
[null,{"$f":"IF($D$8=\"By Rows\",\"C2\",\"B4\")","v":"B4"}]
[null,{"$f":"IF($D$8=\"By Rows\",\"C3\",\"C4\")","v":"C4"}]
[null,{"$f":"IF($D$8=\"By Rows\",\"C4\",\"D4\")","v":"D4"}]
[null,{"$f":"IF($D$8=\"By Rows\",\"C5\",\"E4\")","v":"E4"}]
[null,{"$f":"IF($D$8=\"By Rows\",\"C6\",\"F4\")","v":"F4"}]
[null,{"$f":"IF($D$8=\"By Rows\",\"C7\",\"G4\")","v":"G4"}]
[null,{"$f":"IF($D$8=\"By Rows\",\"C8\",\"H4\")","v":"H4"}]
[null,{"$f":"IF($D$8=\"By Rows\",\"C9\",\"A5\")","v":"A5"}]
[null,{"$f":"IF($D$8=\"By Rows\",\"C10\",\"B5\")","v":"B5"}]
[null,{"$f":"IF($D$8=\"By Rows\",\"C11\",\"C5\")","v":"C5"}]
[null,{"$f":"IF($D$8=\"By Rows\",\"C12\",\"D5\")","v":"D5"}]
[null,{"$f":"IF($D$8=\"By Rows\",\"D1\",\"E5\")","v":"E5"}]
[null,{"$f":"IF($D$8=\"By Rows\",\"D2\",\"F5\")","v":"F5"}]
[null,{"$f":"IF($D$8=\"By Rows\",\"D3\",\"G5\")","v":"G5"}]
[null,{"$f":"IF($D$8=\"By Rows\",\"D4\",\"H5\")","v":"H5"}]
[null,{"$f":"IF($D$8=\"By Rows\",\"D5\",\"A6\")","v":"A6"}]
[null,{"$f":"IF($D$8=\"By Rows\",\"D6\",\"B6\")","v":"B6"}]
[null,{"$f":"IF($D$8=\"By Rows\",\"D7\",\"C6\")","v":"C6"}]
[null,{"$f":"IF($D$8=\"By Rows\",\"D8\",\"D6\")","v":"D6"}]
[null,{"$f":"IF($D$8=\"By Rows\",\"D9\",\"E6\")","v":"E6"}]
[null,{"$f":"IF($D$8=\"By Rows\",\"D10\",\"F6\")","v":"F6"}]
[null,{"$f":"IF($D$8=\"By Rows\",\"D11\",\"G6\")","v":"G6"}]
[null,{"$f":"IF($D$8=\"By Rows\",\"D12\",\"H6\")","v":"H6"}]
[null,{"$f":"IF($D$8=\"By Rows\",\"E1\",\"A7\")","v":"A7"}]
[null,{"$f":"IF($D$8=\"By Rows\",\"E2\",\"B7\")","v":"B7"}]
[null,{"$f":"IF($D$8=\"By Rows\",\"E3\",\"C7\")","v":"C7"}]
[null,{"$f":"IF($D$8=\"By Rows\",\"E4\",\"D7\")","v":"D7"}]
[null,{"$f":"IF($D$8=\"By Rows\",\"E5\",\"E7\")","v":"E7"}]
[null,{"$f":"IF($D$8=\"By Rows\",\"E6\",\"F7\")","v":"F7"}]
[null,{"$f":"IF($D$8=\"By Rows\",\"E7\",\"G7\")","v":"G7"}]
[null,{"$f":"IF($D$8=\"By Rows\",\"E8\",\"H7\")","v":"H7"}]
[null,{"$f":"IF($D$8=\"By Rows\",\"E9\",\"A8\")","v":"A8"}]
[null,{"$f":"IF($D$8=\"By Rows\",\"E10\",\"B8\")","v":"B8"}]
[null,{"$f":"IF($D$8=\"By Rows\",\"E11\",\"C8\")","v":"C8"}]
[null,{"$f":"IF($D$8=\"By Rows\",\"E12\",\"D8\")","v":"D8"}]
[null,{"$f":"IF($D$8=\"By Rows\",\"F1\",\"E8\")","v":"E8"}]
[null,{"$f":"IF($D$8=\"By Rows\",\"F2\",\"F8\")","v":"F8"}]
[null,{"$f":"IF($D$8=\"By Rows\",\"F3\",\"G8\")","v":"G8"}]
[null,{"$f":"IF($D$8=\"By Rows\",\"F4\",\"H8\")","v":"H8"}]
[null,{"$f":"IF($D$8=\"By Rows\",\"F5\",\"A9\")","v":"A9"}]
[null,{"$f":"IF($D$8=\"By Rows\",\"F6\",\"B9\")","v":"B9"}]
[null,{"$f":"IF($D$8=\"By Rows\",\"F7\",\"C9\")","v":"C9"}]
[null,{"$f":"IF($D$8=\"By Rows\",\"F8\",\"D9\")","v":"D9"}]
[null,{"$f":"IF($D$8=\"By Rows\",\"F9\",\"E9\")","v":"E9"}]
[null,{"$f":"IF($D$8=\"By Rows\",\"F10\",\"F9\")","v":"F9"}]
[null,{"$f":"IF($D$8=\"By Rows\",\"F11\",\"G9\")","v":"G9"}]
[null,{"$f":"IF($D$8=\"By Rows\",\"F12\",\"H9\")","v":"H9"}]
[null,{"$f":"IF($D$8=\"By Rows\",\"G1\",\"A10\")","v":"A10"}]
[null,{"$f":"IF($D$8=\"By Rows\",\"G2\",\"B10\")","v":"B10"}]
[null,{"$f":"IF($D$8=\"By Rows\",\"G3\",\"C10\")","v":"C10"}]
[null,{"$f":"IF($D$8=\"By Rows\",\"G4\",\"D10\")","v":"D10"}]
[null,{"$f":"IF($D$8=\"By Rows\",\"G5\",\"E10\")","v":"E10"}]
[null,{"$f":"IF($D$8=\"By Rows\",\"G6\",\"F10\")","v":"F10"}]
[null,{"$f":"IF($D$8=\"By Rows\",\"G7\",\"G10\")","v":"G10"}]
[null,{"$f":"IF($D$8=\"By Rows\",\"G8\",\"H10\")","v":"H10"}]
[null,{"$f":"IF($D$8=\"By Rows\",\"G9\",\"A11\")","v":"A11"}]
[null,{"$f":"IF($D$8=\"By Rows\",\"G10\",\"B11\")","v":"B11"}]
[null,{"$f":"IF($D$8=\"By Rows\",\"G11\",\"C11\")","v":"C11"}]
[null,{"$f":"IF($D$8=\"By Rows\",\"G12\",\"D11\")","v":"D11"}]
[null,{"$f":"IF($D$8=\"By Rows\",\"H1\",\"E11\")","v":"E11"}]
[null,{"$f":"IF($D$8=\"By Rows\",\"H2\",\"F11\")","v":"F11"}]
[null,{"$f":"IF($D$8=\"By Rows\",\"H3\",\"G11\")","v":"G11"}]
[null,{"$f":"IF($D$8=\"By Rows\",\"H4\",\"H11\")","v":"H11"}]
[null,{"$f":"IF($D$8=\"By Rows\",\"H5\",\"A12\")","v":"A12"}]
[null,{"$f":"IF($D$8=\"By Rows\",\"H6\",\"B12\")","v":"B12"}]
[null,{"$f":"IF($D$8=\"By Rows\",\"H7\",\"C12\")","v":"C12"}]
[null,{"$f":"IF($D$8=\"By Rows\",\"H8\",\"D12\")","v":"D12"}]
[null,{"$f":"IF($D$8=\"By Rows\",\"H9\",\"E12\")","v":"E12"}]
[null,{"$f":"IF($D$8=\"By Rows\",\"H10\",\"F12\")","v":"F12"}]
[null,{"$f":"IF($D$8=\"By Rows\",\"H11\",\"G12\")","v":"G12"}]
[null,"H12"]
[]
["We strongly recommend leaving the two reserved wells empty for internal quality control purposes. However, if you include your own samples in the reserved wells as well, we will not be able to evaluate the quality of the generated sequence data.",null,null,null,null,null,null,"© Eurofins Genomics"]

{"sheet":"Plate 07","index":9,"n_rows":110,"n_cols":11,"rows_kept":110,"cut":false,"hidden":false,"merged":[[1,6,1,7],[2,6,2,7],[3,6,3,7],[4,6,4,7],[109,0,112,6]]}
[]
[null,null,"Plate Information",null,null,"Tools ","Requirements"]
[null,null,"Plate Barcode:",null,null,null,"You must enter/select a primer name"]
[null,null,"*Sample Type:",null,null,"Help Page","Reserved for Control Samples"]
[null,null,"Add. Service:",null,null,null," *24 or more Samples/plate"]
[null,null,"*Advanced Options:","Standard"]
[null,null,"Template Specification:"]
[null,null,"*Plate Layout:","By Columns"]
[]
[]
[]
[null,"Well Position","*Sample Name","Primer 1","Sequence to synthesize or Barcode for enclosed primers","Primer 2","Sequence to synthesize or Barcode for enclosed primers","Primer 3","Sequence to synthesize or Barcode for enclosed primers","Primer 4","Sequence to synthesize or Barcode for enclosed primers"]
[null,"A1"]
[null,{"$f":"IF($D$8=\"By Rows\",\"A2\",\"B1\")","v":"B1"}]
[null,{"$f":"IF($D$8=\"By Rows\",\"A3\",\"C1\")","v":"C1"}]
[null,{"$f":"IF($D$8=\"By Rows\",\"A4\",\"D1\")","v":"D1"}]
[null,{"$f":"IF($D$8=\"By Rows\",\"A5\",\"E1\")","v":"E1"}]
[null,{"$f":"IF($D$8=\"By Rows\",\"A6\",\"F1\")","v":"F1"}]
[null,{"$f":"IF($D$8=\"By Rows\",\"A7\",\"G1\")","v":"G1"}]
[null,{"$f":"IF($D$8=\"By Rows\",\"A8\",\"H1\")","v":"H1"}]
[null,{"$f":"IF($D$8=\"By Rows\",\"A9\",\"A2\")","v":"A2"}]
[null,{"$f":"IF($D$8=\"By Rows\",\"A10\",\"B2\")","v":"B2"}]
[null,{"$f":"IF($D$8=\"By Rows\",\"A11\",\"C2\")","v":"C2"}]
[null,{"$f":"IF($D$8=\"By Rows\",\"A12\",\"D2\")","v":"D2"}]
[null,{"$f":"IF($D$8=\"By Rows\",\"B1\",\"E2\")","v":"E2"}]
[null,{"$f":"IF($D$8=\"By Rows\",\"B2\",\"F2\")","v":"F2"}]
[null,{"$f":"IF($D$8=\"By Rows\",\"B3\",\"G2\")","v":"G2"}]
[null,{"$f":"IF($D$8=\"By Rows\",\"B4\",\"H2\")","v":"H2"}]
[null,{"$f":"IF($D$8=\"By Rows\",\"B5\",\"A3\")","v":"A3"}]
[null,{"$f":"IF($D$8=\"By Rows\",\"B6\",\"B3\")","v":"B3"}]
[null,{"$f":"IF($D$8=\"By Rows\",\"B7\",\"C3\")","v":"C3"}]
[null,{"$f":"IF($D$8=\"By Rows\",\"B8\",\"D3\")","v":"D3"}]
[null,{"$f":"IF($D$8=\"By Rows\",\"B9\",\"E3\")","v":"E3"}]
[null,{"$f":"IF($D$8=\"By Rows\",\"B10\",\"F3\")","v":"F3"}]
[null,{"$f":"IF($D$8=\"By Rows\",\"B11\",\"G3\")","v":"G3"}]
[null,{"$f":"IF($D$8=\"By Rows\",\"B12\",\"H3\")","v":"H3"}]
[null,{"$f":"IF($D$8=\"By Rows\",\"C1\",\"A4\")","v":"A4"}]
[null,{"$f":"IF($D$8=\"By Rows\",\"C2\",\"B4\")","v":"B4"}]
[null,{"$f":"IF($D$8=\"By Rows\",\"C3\",\"C4\")","v":"C4"}]
[null,{"$f":"IF($D$8=\"By Rows\",\"C4\",\"D4\")","v":"D4"}]
[null,{"$f":"IF($D$8=\"By Rows\",\"C5\",\"E4\")","v":"E4"}]
[null,{"$f":"IF($D$8=\"By Rows\",\"C6\",\"F4\")","v":"F4"}]
[null,{"$f":"IF($D$8=\"By Rows\",\"C7\",\"G4\")","v":"G4"}]
[null,{"$f":"IF($D$8=\"By Rows\",\"C8\",\"H4\")","v":"H4"}]
[null,{"$f":"IF($D$8=\"By Rows\",\"C9\",\"A5\")","v":"A5"}]
[null,{"$f":"IF($D$8=\"By Rows\",\"C10\",\"B5\")","v":"B5"}]
[null,{"$f":"IF($D$8=\"By Rows\",\"C11\",\"C5\")","v":"C5"}]
[null,{"$f":"IF($D$8=\"By Rows\",\"C12\",\"D5\")","v":"D5"}]
[null,{"$f":"IF($D$8=\"By Rows\",\"D1\",\"E5\")","v":"E5"}]
[null,{"$f":"IF($D$8=\"By Rows\",\"D2\",\"F5\")","v":"F5"}]
[null,{"$f":"IF($D$8=\"By Rows\",\"D3\",\"G5\")","v":"G5"}]
[null,{"$f":"IF($D$8=\"By Rows\",\"D4\",\"H5\")","v":"H5"}]
[null,{"$f":"IF($D$8=\"By Rows\",\"D5\",\"A6\")","v":"A6"}]
[null,{"$f":"IF($D$8=\"By Rows\",\"D6\",\"B6\")","v":"B6"}]
[null,{"$f":"IF($D$8=\"By Rows\",\"D7\",\"C6\")","v":"C6"}]
[null,{"$f":"IF($D$8=\"By Rows\",\"D8\",\"D6\")","v":"D6"}]
[null,{"$f":"IF($D$8=\"By Rows\",\"D9\",\"E6\")","v":"E6"}]
[null,{"$f":"IF($D$8=\"By Rows\",\"D10\",\"F6\")","v":"F6"}]
[null,{"$f":"IF($D$8=\"By Rows\",\"D11\",\"G6\")","v":"G6"}]
[null,{"$f":"IF($D$8=\"By Rows\",\"D12\",\"H6\")","v":"H6"}]
[null,{"$f":"IF($D$8=\"By Rows\",\"E1\",\"A7\")","v":"A7"}]
[null,{"$f":"IF($D$8=\"By Rows\",\"E2\",\"B7\")","v":"B7"}]
[null,{"$f":"IF($D$8=\"By Rows\",\"E3\",\"C7\")","v":"C7"}]
[null,{"$f":"IF($D$8=\"By Rows\",\"E4\",\"D7\")","v":"D7"}]
[null,{"$f":"IF($D$8=\"By Rows\",\"E5\",\"E7\")","v":"E7"}]
[null,{"$f":"IF($D$8=\"By Rows\",\"E6\",\"F7\")","v":"F7"}]
[null,{"$f":"IF($D$8=\"By Rows\",\"E7\",\"G7\")","v":"G7"}]
[null,{"$f":"IF($D$8=\"By Rows\",\"E8\",\"H7\")","v":"H7"}]
[null,{"$f":"IF($D$8=\"By Rows\",\"E9\",\"A8\")","v":"A8"}]
[null,{"$f":"IF($D$8=\"By Rows\",\"E10\",\"B8\")","v":"B8"}]
[null,{"$f":"IF($D$8=\"By Rows\",\"E11\",\"C8\")","v":"C8"}]
[null,{"$f":"IF($D$8=\"By Rows\",\"E12\",\"D8\")","v":"D8"}]
[null,{"$f":"IF($D$8=\"By Rows\",\"F1\",\"E8\")","v":"E8"}]
[null,{"$f":"IF($D$8=\"By Rows\",\"F2\",\"F8\")","v":"F8"}]
[null,{"$f":"IF($D$8=\"By Rows\",\"F3\",\"G8\")","v":"G8"}]
[null,{"$f":"IF($D$8=\"By Rows\",\"F4\",\"H8\")","v":"H8"}]
[null,{"$f":"IF($D$8=\"By Rows\",\"F5\",\"A9\")","v":"A9"}]
[null,{"$f":"IF($D$8=\"By Rows\",\"F6\",\"B9\")","v":"B9"}]
[null,{"$f":"IF($D$8=\"By Rows\",\"F7\",\"C9\")","v":"C9"}]
[null,{"$f":"IF($D$8=\"By Rows\",\"F8\",\"D9\")","v":"D9"}]
[null,{"$f":"IF($D$8=\"By Rows\",\"F9\",\"E9\")","v":"E9"}]
[null,{"$f":"IF($D$8=\"By Rows\",\"F10\",\"F9\")","v":"F9"}]
[null,{"$f":"IF($D$8=\"By Rows\",\"F11\",\"G9\")","v":"G9"}]
[null,{"$f":"IF($D$8=\"By Rows\",\"F12\",\"H9\")","v":"H9"}]
[null,{"$f":"IF($D$8=\"By Rows\",\"G1\",\"A10\")","v":"A10"}]
[null,{"$f":"IF($D$8=\"By Rows\",\"G2\",\"B10\")","v":"B10"}]
[null,{"$f":"IF($D$8=\"By Rows\",\"G3\",\"C10\")","v":"C10"}]
[null,{"$f":"IF($D$8=\"By Rows\",\"G4\",\"D10\")","v":"D10"}]
[null,{"$f":"IF($D$8=\"By Rows\",\"G5\",\"E10\")","v":"E10"}]
[null,{"$f":"IF($D$8=\"By Rows\",\"G6\",\"F10\")","v":"F10"}]
[null,{"$f":"IF($D$8=\"By Rows\",\"G7\",\"G10\")","v":"G10"}]
[null,{"$f":"IF($D$8=\"By Rows\",\"G8\",\"H10\")","v":"H10"}]
[null,{"$f":"IF($D$8=\"By Rows\",\"G9\",\"A11\")","v":"A11"}]
[null,{"$f":"IF($D$8=\"By Rows\",\"G10\",\"B11\")","v":"B11"}]
[null,{"$f":"IF($D$8=\"By Rows\",\"G11\",\"C11\")","v":"C11"}]
[null,{"$f":"IF($D$8=\"By Rows\",\"G12\",\"D11\")","v":"D11"}]
[null,{"$f":"IF($D$8=\"By Rows\",\"H1\",\"E11\")","v":"E11"}]
[null,{"$f":"IF($D$8=\"By Rows\",\"H2\",\"F11\")","v":"F11"}]
[null,{"$f":"IF($D$8=\"By Rows\",\"H3\",\"G11\")","v":"G11"}]
[null,{"$f":"IF($D$8=\"By Rows\",\"H4\",\"H11\")","v":"H11"}]
[null,{"$f":"IF($D$8=\"By Rows\",\"H5\",\"A12\")","v":"A12"}]
[null,{"$f":"IF($D$8=\"By Rows\",\"H6\",\"B12\")","v":"B12"}]
[null,{"$f":"IF($D$8=\"By Rows\",\"H7\",\"C12\")","v":"C12"}]
[null,{"$f":"IF($D$8=\"By Rows\",\"H8\",\"D12\")","v":"D12"}]
[null,{"$f":"IF($D$8=\"By Rows\",\"H9\",\"E12\")","v":"E12"}]
[null,{"$f":"IF($D$8=\"By Rows\",\"H10\",\"F12\")","v":"F12"}]
[null,{"$f":"IF($D$8=\"By Rows\",\"H11\",\"G12\")","v":"G12"}]
[null,"H12"]
[]
["We strongly recommend leaving the two reserved wells empty for internal quality control purposes. However, if you include your own samples in the reserved wells as well, we will not be able to evaluate the quality of the generated sequence data.",null,null,null,null,null,null,"© Eurofins Genomics"]

{"sheet":"Plate 08","index":10,"n_rows":110,"n_cols":11,"rows_kept":110,"cut":false,"hidden":false,"merged":[[1,6,1,7],[4,6,4,7],[3,6,3,7],[2,6,2,7],[109,0,112,6]]}
[]
[null,null,"Plate Information",null,null,"Tools ","Requirements"]
[null,null,"Plate Barcode:",null,null,null,"You must enter/select a primer name"]
[null,null,"*Sample Type:",null,null,"Helpful Tips","Reserved for Control Samples"]
[null,null,"Add. Service:",null,null,null," *24 or more Samples/plate"]
[null,null,"*Advanced Options:","Standard"]
[null,null,"Template Specification:",null,null,null,null,null,null,"Click logo for more information"]
[null,null,"*Plate Layout:","By Columns"]
[]
[]
[]
[null,"Well Position","*Sample Name","Primer 1","Sequence to synthesize or Barcode for enclosed primers","Primer 2","Sequence to synthesize or Barcode for enclosed primers","Primer 3","Sequence to synthesize or Barcode for enclosed primers","Primer 4","Sequence to synthesize or Barcode for enclosed primers"]
[null,"A1"]
[null,{"$f":"IF($D$8=\"By Rows\",\"A2\",\"B1\")","v":"B1"}]
[null,{"$f":"IF($D$8=\"By Rows\",\"A3\",\"C1\")","v":"C1"}]
[null,{"$f":"IF($D$8=\"By Rows\",\"A4\",\"D1\")","v":"D1"}]
[null,{"$f":"IF($D$8=\"By Rows\",\"A5\",\"E1\")","v":"E1"}]
[null,{"$f":"IF($D$8=\"By Rows\",\"A6\",\"F1\")","v":"F1"}]
[null,{"$f":"IF($D$8=\"By Rows\",\"A7\",\"G1\")","v":"G1"}]
[null,{"$f":"IF($D$8=\"By Rows\",\"A8\",\"H1\")","v":"H1"}]
[null,{"$f":"IF($D$8=\"By Rows\",\"A9\",\"A2\")","v":"A2"}]
[null,{"$f":"IF($D$8=\"By Rows\",\"A10\",\"B2\")","v":"B2"}]
[null,{"$f":"IF($D$8=\"By Rows\",\"A11\",\"C2\")","v":"C2"}]
[null,{"$f":"IF($D$8=\"By Rows\",\"A12\",\"D2\")","v":"D2"}]
[null,{"$f":"IF($D$8=\"By Rows\",\"B1\",\"E2\")","v":"E2"}]
[null,{"$f":"IF($D$8=\"By Rows\",\"B2\",\"F2\")","v":"F2"}]
[null,{"$f":"IF($D$8=\"By Rows\",\"B3\",\"G2\")","v":"G2"}]
[null,{"$f":"IF($D$8=\"By Rows\",\"B4\",\"H2\")","v":"H2"}]
[null,{"$f":"IF($D$8=\"By Rows\",\"B5\",\"A3\")","v":"A3"}]
[null,{"$f":"IF($D$8=\"By Rows\",\"B6\",\"B3\")","v":"B3"}]
[null,{"$f":"IF($D$8=\"By Rows\",\"B7\",\"C3\")","v":"C3"}]
[null,{"$f":"IF($D$8=\"By Rows\",\"B8\",\"D3\")","v":"D3"}]
[null,{"$f":"IF($D$8=\"By Rows\",\"B9\",\"E3\")","v":"E3"}]
[null,{"$f":"IF($D$8=\"By Rows\",\"B10\",\"F3\")","v":"F3"}]
[null,{"$f":"IF($D$8=\"By Rows\",\"B11\",\"G3\")","v":"G3"}]
[null,{"$f":"IF($D$8=\"By Rows\",\"B12\",\"H3\")","v":"H3"}]
[null,{"$f":"IF($D$8=\"By Rows\",\"C1\",\"A4\")","v":"A4"}]
[null,{"$f":"IF($D$8=\"By Rows\",\"C2\",\"B4\")","v":"B4"}]
[null,{"$f":"IF($D$8=\"By Rows\",\"C3\",\"C4\")","v":"C4"}]
[null,{"$f":"IF($D$8=\"By Rows\",\"C4\",\"D4\")","v":"D4"}]
[null,{"$f":"IF($D$8=\"By Rows\",\"C5\",\"E4\")","v":"E4"}]
[null,{"$f":"IF($D$8=\"By Rows\",\"C6\",\"F4\")","v":"F4"}]
[null,{"$f":"IF($D$8=\"By Rows\",\"C7\",\"G4\")","v":"G4"}]
[null,{"$f":"IF($D$8=\"By Rows\",\"C8\",\"H4\")","v":"H4"}]
[null,{"$f":"IF($D$8=\"By Rows\",\"C9\",\"A5\")","v":"A5"}]
[null,{"$f":"IF($D$8=\"By Rows\",\"C10\",\"B5\")","v":"B5"}]
[null,{"$f":"IF($D$8=\"By Rows\",\"C11\",\"C5\")","v":"C5"}]
[null,{"$f":"IF($D$8=\"By Rows\",\"C12\",\"D5\")","v":"D5"}]
[null,{"$f":"IF($D$8=\"By Rows\",\"D1\",\"E5\")","v":"E5"}]
[null,{"$f":"IF($D$8=\"By Rows\",\"D2\",\"F5\")","v":"F5"}]
[null,{"$f":"IF($D$8=\"By Rows\",\"D3\",\"G5\")","v":"G5"}]
[null,{"$f":"IF($D$8=\"By Rows\",\"D4\",\"H5\")","v":"H5"}]
[null,{"$f":"IF($D$8=\"By Rows\",\"D5\",\"A6\")","v":"A6"}]
[null,{"$f":"IF($D$8=\"By Rows\",\"D6\",\"B6\")","v":"B6"}]
[null,{"$f":"IF($D$8=\"By Rows\",\"D7\",\"C6\")","v":"C6"}]
[null,{"$f":"IF($D$8=\"By Rows\",\"D8\",\"D6\")","v":"D6"}]
[null,{"$f":"IF($D$8=\"By Rows\",\"D9\",\"E6\")","v":"E6"}]
[null,{"$f":"IF($D$8=\"By Rows\",\"D10\",\"F6\")","v":"F6"}]
[null,{"$f":"IF($D$8=\"By Rows\",\"D11\",\"G6\")","v":"G6"}]
[null,{"$f":"IF($D$8=\"By Rows\",\"D12\",\"H6\")","v":"H6"}]
[null,{"$f":"IF($D$8=\"By Rows\",\"E1\",\"A7\")","v":"A7"}]
[null,{"$f":"IF($D$8=\"By Rows\",\"E2\",\"B7\")","v":"B7"}]
[null,{"$f":"IF($D$8=\"By Rows\",\"E3\",\"C7\")","v":"C7"}]
[null,{"$f":"IF($D$8=\"By Rows\",\"E4\",\"D7\")","v":"D7"}]
[null,{"$f":"IF($D$8=\"By Rows\",\"E5\",\"E7\")","v":"E7"}]
[null,{"$f":"IF($D$8=\"By Rows\",\"E6\",\"F7\")","v":"F7"}]
[null,{"$f":"IF($D$8=\"By Rows\",\"E7\",\"G7\")","v":"G7"}]
[null,{"$f":"IF($D$8=\"By Rows\",\"E8\",\"H7\")","v":"H7"}]
[null,{"$f":"IF($D$8=\"By Rows\",\"E9\",\"A8\")","v":"A8"}]
[null,{"$f":"IF($D$8=\"By Rows\",\"E10\",\"B8\")","v":"B8"}]
[null,{"$f":"IF($D$8=\"By Rows\",\"E11\",\"C8\")","v":"C8"}]
[null,{"$f":"IF($D$8=\"By Rows\",\"E12\",\"D8\")","v":"D8"}]
[null,{"$f":"IF($D$8=\"By Rows\",\"F1\",\"E8\")","v":"E8"}]
[null,{"$f":"IF($D$8=\"By Rows\",\"F2\",\"F8\")","v":"F8"}]
[null,{"$f":"IF($D$8=\"By Rows\",\"F3\",\"G8\")","v":"G8"}]
[null,{"$f":"IF($D$8=\"By Rows\",\"F4\",\"H8\")","v":"H8"}]
[null,{"$f":"IF($D$8=\"By Rows\",\"F5\",\"A9\")","v":"A9"}]
[null,{"$f":"IF($D$8=\"By Rows\",\"F6\",\"B9\")","v":"B9"}]
[null,{"$f":"IF($D$8=\"By Rows\",\"F7\",\"C9\")","v":"C9"}]
[null,{"$f":"IF($D$8=\"By Rows\",\"F8\",\"D9\")","v":"D9"}]
[null,{"$f":"IF($D$8=\"By Rows\",\"F9\",\"E9\")","v":"E9"}]
[null,{"$f":"IF($D$8=\"By Rows\",\"F10\",\"F9\")","v":"F9"}]
[null,{"$f":"IF($D$8=\"By Rows\",\"F11\",\"G9\")","v":"G9"}]
[null,{"$f":"IF($D$8=\"By Rows\",\"F12\",\"H9\")","v":"H9"}]
[null,{"$f":"IF($D$8=\"By Rows\",\"G1\",\"A10\")","v":"A10"}]
[null,{"$f":"IF($D$8=\"By Rows\",\"G2\",\"B10\")","v":"B10"}]
[null,{"$f":"IF($D$8=\"By Rows\",\"G3\",\"C10\")","v":"C10"}]
[null,{"$f":"IF($D$8=\"By Rows\",\"G4\",\"D10\")","v":"D10"}]
[null,{"$f":"IF($D$8=\"By Rows\",\"G5\",\"E10\")","v":"E10"}]
[null,{"$f":"IF($D$8=\"By Rows\",\"G6\",\"F10\")","v":"F10"}]
[null,{"$f":"IF($D$8=\"By Rows\",\"G7\",\"G10\")","v":"G10"}]
[null,{"$f":"IF($D$8=\"By Rows\",\"G8\",\"H10\")","v":"H10"}]
[null,{"$f":"IF($D$8=\"By Rows\",\"G9\",\"A11\")","v":"A11"}]
[null,{"$f":"IF($D$8=\"By Rows\",\"G10\",\"B11\")","v":"B11"}]
[null,{"$f":"IF($D$8=\"By Rows\",\"G11\",\"C11\")","v":"C11"}]
[null,{"$f":"IF($D$8=\"By Rows\",\"G12\",\"D11\")","v":"D11"}]
[null,{"$f":"IF($D$8=\"By Rows\",\"H1\",\"E11\")","v":"E11"}]
[null,{"$f":"IF($D$8=\"By Rows\",\"H2\",\"F11\")","v":"F11"}]
[null,{"$f":"IF($D$8=\"By Rows\",\"H3\",\"G11\")","v":"G11"}]
[null,{"$f":"IF($D$8=\"By Rows\",\"H4\",\"H11\")","v":"H11"}]
[null,{"$f":"IF($D$8=\"By Rows\",\"H5\",\"A12\")","v":"A12"}]
[null,{"$f":"IF($D$8=\"By Rows\",\"H6\",\"B12\")","v":"B12"}]
[null,{"$f":"IF($D$8=\"By Rows\",\"H7\",\"C12\")","v":"C12"}]
[null,{"$f":"IF($D$8=\"By Rows\",\"H8\",\"D12\")","v":"D12"}]
[null,{"$f":"IF($D$8=\"By Rows\",\"H9\",\"E12\")","v":"E12"}]
[null,{"$f":"IF($D$8=\"By Rows\",\"H10\",\"F12\")","v":"F12"}]
[null,{"$f":"IF($D$8=\"By Rows\",\"H11\",\"G12\")","v":"G12"}]
[null,"H12"]
[]
["We strongly recommend leaving the two reserved wells empty for internal quality control purposes. However, if you include your own samples in the reserved wells as well, we will not be able to evaluate the quality of the generated sequence data.",null,null,null,null,null,null,"© Eurofins Genomics"]

{"sheet":"Plate 09","index":11,"n_rows":110,"n_cols":11,"rows_kept":110,"cut":false,"hidden":false,"merged":[[1,6,1,7],[2,6,2,7],[3,6,3,7],[4,6,4,7],[109,0,112,6]]}
[]
[null,null,"Plate Information",null,null,"Tools ","Requirements"]
[null,null,"Plate Barcode:",null,null,null,"You must enter/select a primer name"]
[null,null,"*Sample Type:",null,null,"Help Page","Reserved for Control Samples"]
[null,null,"Add. Service:",null,null,null," *24 or more Samples/plate"]
[null,null,"*Advanced Options:","Standard"]
[null,null,"Template Specification:"]
[null,null,"*Plate Layout:","By Columns"]
[]
[]
[]
[null,"Well Position","*Sample Name","Primer 1","Sequence to synthesize or Barcode for enclosed primers","Primer 2","Sequence to synthesize or Barcode for enclosed primers","Primer 3","Sequence to synthesize or Barcode for enclosed primers","Primer 4","Sequence to synthesize or Barcode for enclosed primers"]
[null,"A1"]
[null,{"$f":"IF($D$8=\"By Rows\",\"A2\",\"B1\")","v":"B1"}]
[null,{"$f":"IF($D$8=\"By Rows\",\"A3\",\"C1\")","v":"C1"}]
[null,{"$f":"IF($D$8=\"By Rows\",\"A4\",\"D1\")","v":"D1"}]
[null,{"$f":"IF($D$8=\"By Rows\",\"A5\",\"E1\")","v":"E1"}]
[null,{"$f":"IF($D$8=\"By Rows\",\"A6\",\"F1\")","v":"F1"}]
[null,{"$f":"IF($D$8=\"By Rows\",\"A7\",\"G1\")","v":"G1"}]
[null,{"$f":"IF($D$8=\"By Rows\",\"A8\",\"H1\")","v":"H1"}]
[null,{"$f":"IF($D$8=\"By Rows\",\"A9\",\"A2\")","v":"A2"}]
[null,{"$f":"IF($D$8=\"By Rows\",\"A10\",\"B2\")","v":"B2"}]
[null,{"$f":"IF($D$8=\"By Rows\",\"A11\",\"C2\")","v":"C2"}]
[null,{"$f":"IF($D$8=\"By Rows\",\"A12\",\"D2\")","v":"D2"}]
[null,{"$f":"IF($D$8=\"By Rows\",\"B1\",\"E2\")","v":"E2"}]
[null,{"$f":"IF($D$8=\"By Rows\",\"B2\",\"F2\")","v":"F2"}]
[null,{"$f":"IF($D$8=\"By Rows\",\"B3\",\"G2\")","v":"G2"}]
[null,{"$f":"IF($D$8=\"By Rows\",\"B4\",\"H2\")","v":"H2"}]
[null,{"$f":"IF($D$8=\"By Rows\",\"B5\",\"A3\")","v":"A3"}]
[null,{"$f":"IF($D$8=\"By Rows\",\"B6\",\"B3\")","v":"B3"}]
[null,{"$f":"IF($D$8=\"By Rows\",\"B7\",\"C3\")","v":"C3"}]
[null,{"$f":"IF($D$8=\"By Rows\",\"B8\",\"D3\")","v":"D3"}]
[null,{"$f":"IF($D$8=\"By Rows\",\"B9\",\"E3\")","v":"E3"}]
[null,{"$f":"IF($D$8=\"By Rows\",\"B10\",\"F3\")","v":"F3"}]
[null,{"$f":"IF($D$8=\"By Rows\",\"B11\",\"G3\")","v":"G3"}]
[null,{"$f":"IF($D$8=\"By Rows\",\"B12\",\"H3\")","v":"H3"}]
[null,{"$f":"IF($D$8=\"By Rows\",\"C1\",\"A4\")","v":"A4"}]
[null,{"$f":"IF($D$8=\"By Rows\",\"C2\",\"B4\")","v":"B4"}]
[null,{"$f":"IF($D$8=\"By Rows\",\"C3\",\"C4\")","v":"C4"}]
[null,{"$f":"IF($D$8=\"By Rows\",\"C4\",\"D4\")","v":"D4"}]
[null,{"$f":"IF($D$8=\"By Rows\",\"C5\",\"E4\")","v":"E4"}]
[null,{"$f":"IF($D$8=\"By Rows\",\"C6\",\"F4\")","v":"F4"}]
[null,{"$f":"IF($D$8=\"By Rows\",\"C7\",\"G4\")","v":"G4"}]
[null,{"$f":"IF($D$8=\"By Rows\",\"C8\",\"H4\")","v":"H4"}]
[null,{"$f":"IF($D$8=\"By Rows\",\"C9\",\"A5\")","v":"A5"}]
[null,{"$f":"IF($D$8=\"By Rows\",\"C10\",\"B5\")","v":"B5"}]
[null,{"$f":"IF($D$8=\"By Rows\",\"C11\",\"C5\")","v":"C5"}]
[null,{"$f":"IF($D$8=\"By Rows\",\"C12\",\"D5\")","v":"D5"}]
[null,{"$f":"IF($D$8=\"By Rows\",\"D1\",\"E5\")","v":"E5"}]
[null,{"$f":"IF($D$8=\"By Rows\",\"D2\",\"F5\")","v":"F5"}]
[null,{"$f":"IF($D$8=\"By Rows\",\"D3\",\"G5\")","v":"G5"}]
[null,{"$f":"IF($D$8=\"By Rows\",\"D4\",\"H5\")","v":"H5"}]
[null,{"$f":"IF($D$8=\"By Rows\",\"D5\",\"A6\")","v":"A6"}]
[null,{"$f":"IF($D$8=\"By Rows\",\"D6\",\"B6\")","v":"B6"}]
[null,{"$f":"IF($D$8=\"By Rows\",\"D7\",\"C6\")","v":"C6"}]
[null,{"$f":"IF($D$8=\"By Rows\",\"D8\",\"D6\")","v":"D6"}]
[null,{"$f":"IF($D$8=\"By Rows\",\"D9\",\"E6\")","v":"E6"}]
[null,{"$f":"IF($D$8=\"By Rows\",\"D10\",\"F6\")","v":"F6"}]
[null,{"$f":"IF($D$8=\"By Rows\",\"D11\",\"G6\")","v":"G6"}]
[null,{"$f":"IF($D$8=\"By Rows\",\"D12\",\"H6\")","v":"H6"}]
[null,{"$f":"IF($D$8=\"By Rows\",\"E1\",\"A7\")","v":"A7"}]
[null,{"$f":"IF($D$8=\"By Rows\",\"E2\",\"B7\")","v":"B7"}]
[null,{"$f":"IF($D$8=\"By Rows\",\"E3\",\"C7\")","v":"C7"}]
[null,{"$f":"IF($D$8=\"By Rows\",\"E4\",\"D7\")","v":"D7"}]
[null,{"$f":"IF($D$8=\"By Rows\",\"E5\",\"E7\")","v":"E7"}]
[null,{"$f":"IF($D$8=\"By Rows\",\"E6\",\"F7\")","v":"F7"}]
[null,{"$f":"IF($D$8=\"By Rows\",\"E7\",\"G7\")","v":"G7"}]
[null,{"$f":"IF($D$8=\"By Rows\",\"E8\",\"H7\")","v":"H7"}]
[null,{"$f":"IF($D$8=\"By Rows\",\"E9\",\"A8\")","v":"A8"}]
[null,{"$f":"IF($D$8=\"By Rows\",\"E10\",\"B8\")","v":"B8"}]
[null,{"$f":"IF($D$8=\"By Rows\",\"E11\",\"C8\")","v":"C8"}]
[null,{"$f":"IF($D$8=\"By Rows\",\"E12\",\"D8\")","v":"D8"}]
[null,{"$f":"IF($D$8=\"By Rows\",\"F1\",\"E8\")","v":"E8"}]
[null,{"$f":"IF($D$8=\"By Rows\",\"F2\",\"F8\")","v":"F8"}]
[null,{"$f":"IF($D$8=\"By Rows\",\"F3\",\"G8\")","v":"G8"}]
[null,{"$f":"IF($D$8=\"By Rows\",\"F4\",\"H8\")","v":"H8"}]
[null,{"$f":"IF($D$8=\"By Rows\",\"F5\",\"A9\")","v":"A9"}]
[null,{"$f":"IF($D$8=\"By Rows\",\"F6\",\"B9\")","v":"B9"}]
[null,{"$f":"IF($D$8=\"By Rows\",\"F7\",\"C9\")","v":"C9"}]
[null,{"$f":"IF($D$8=\"By Rows\",\"F8\",\"D9\")","v":"D9"}]
[null,{"$f":"IF($D$8=\"By Rows\",\"F9\",\"E9\")","v":"E9"}]
[null,{"$f":"IF($D$8=\"By Rows\",\"F10\",\"F9\")","v":"F9"}]
[null,{"$f":"IF($D$8=\"By Rows\",\"F11\",\"G9\")","v":"G9"}]
[null,{"$f":"IF($D$8=\"By Rows\",\"F12\",\"H9\")","v":"H9"}]
[null,{"$f":"IF($D$8=\"By Rows\",\"G1\",\"A10\")","v":"A10"}]
[null,{"$f":"IF($D$8=\"By Rows\",\"G2\",\"B10\")","v":"B10"}]
[null,{"$f":"IF($D$8=\"By Rows\",\"G3\",\"C10\")","v":"C10"}]
[null,{"$f":"IF($D$8=\"By Rows\",\"G4\",\"D10\")","v":"D10"}]
[null,{"$f":"IF($D$8=\"By Rows\",\"G5\",\"E10\")","v":"E10"}]
[null,{"$f":"IF($D$8=\"By Rows\",\"G6\",\"F10\")","v":"F10"}]
[null,{"$f":"IF($D$8=\"By Rows\",\"G7\",\"G10\")","v":"G10"}]
[null,{"$f":"IF($D$8=\"By Rows\",\"G8\",\"H10\")","v":"H10"}]
[null,{"$f":"IF($D$8=\"By Rows\",\"G9\",\"A11\")","v":"A11"}]
[null,{"$f":"IF($D$8=\"By Rows\",\"G10\",\"B11\")","v":"B11"}]
[null,{"$f":"IF($D$8=\"By Rows\",\"G11\",\"C11\")","v":"C11"}]
[null,{"$f":"IF($D$8=\"By Rows\",\"G12\",\"D11\")","v":"D11"}]
[null,{"$f":"IF($D$8=\"By Rows\",\"H1\",\"E11\")","v":"E11"}]
[null,{"$f":"IF($D$8=\"By Rows\",\"H2\",\"F11\")","v":"F11"}]
[null,{"$f":"IF($D$8=\"By Rows\",\"H3\",\"G11\")","v":"G11"}]
[null,{"$f":"IF($D$8=\"By Rows\",\"H4\",\"H11\")","v":"H11"}]
[null,{"$f":"IF($D$8=\"By Rows\",\"H5\",\"A12\")","v":"A12"}]
[null,{"$f":"IF($D$8=\"By Rows\",\"H6\",\"B12\")","v":"B12"}]
[null,{"$f":"IF($D$8=\"By Rows\",\"H7\",\"C12\")","v":"C12"}]
[null,{"$f":"IF($D$8=\"By Rows\",\"H8\",\"D12\")","v":"D12"}]
[null,{"$f":"IF($D$8=\"By Rows\",\"H9\",\"E12\")","v":"E12"}]
[null,{"$f":"IF($D$8=\"By Rows\",\"H10\",\"F12\")","v":"F12"}]
[null,{"$f":"IF($D$8=\"By Rows\",\"H11\",\"G12\")","v":"G12"}]
[null,"H12"]
[]
["We strongly recommend leaving the two reserved wells empty for internal quality control purposes. However, if you include your own samples in the reserved wells as well, we will not be able to evaluate the quality of the generated sequence data.",null,null,null,null,null,null,"© Eurofins Genomics"]

{"sheet":"Plate 10","index":12,"n_rows":110,"n_cols":11,"rows_kept":110,"cut":false,"hidden":false,"merged":[[1,6,1,7],[2,6,2,7],[3,6,3,7],[4,6,4,7],[109,0,112,6]]}
[]
[null,null,"Plate Information",null,null,"Tools ","Requirements"]
[null,null,"Plate Barcode:",null,null,null,"You must enter/select a primer name"]
[null,null,"*Sample Type:",null,null,"Help Page","Reserved for Control Samples"]
[null,null,"Add. Service:",null,null,null," *24 or more Samples/plate"]
[null,null,"*Advanced Options:","Standard"]
[null,null,"Template Specification:"]
[null,null,"*Plate Layout:","By Columns"]
[]
[]
[]
[null,"Well Position","*Sample Name","Primer 1","Sequence to synthesize or Barcode for enclosed primers","Primer 2","Sequence to synthesize or Barcode for enclosed primers","Primer 3","Sequence to synthesize or Barcode for enclosed primers","Primer 4","Sequence to synthesize or Barcode for enclosed primers"]
[null,"A1"]
[null,{"$f":"IF($D$8=\"By Rows\",\"A2\",\"B1\")","v":"B1"}]
[null,{"$f":"IF($D$8=\"By Rows\",\"A3\",\"C1\")","v":"C1"}]
[null,{"$f":"IF($D$8=\"By Rows\",\"A4\",\"D1\")","v":"D1"}]
[null,{"$f":"IF($D$8=\"By Rows\",\"A5\",\"E1\")","v":"E1"}]
[null,{"$f":"IF($D$8=\"By Rows\",\"A6\",\"F1\")","v":"F1"}]
[null,{"$f":"IF($D$8=\"By Rows\",\"A7\",\"G1\")","v":"G1"}]
[null,{"$f":"IF($D$8=\"By Rows\",\"A8\",\"H1\")","v":"H1"}]
[null,{"$f":"IF($D$8=\"By Rows\",\"A9\",\"A2\")","v":"A2"}]
[null,{"$f":"IF($D$8=\"By Rows\",\"A10\",\"B2\")","v":"B2"}]
[null,{"$f":"IF($D$8=\"By Rows\",\"A11\",\"C2\")","v":"C2"}]
[null,{"$f":"IF($D$8=\"By Rows\",\"A12\",\"D2\")","v":"D2"}]
[null,{"$f":"IF($D$8=\"By Rows\",\"B1\",\"E2\")","v":"E2"}]
[null,{"$f":"IF($D$8=\"By Rows\",\"B2\",\"F2\")","v":"F2"}]
[null,{"$f":"IF($D$8=\"By Rows\",\"B3\",\"G2\")","v":"G2"}]
[null,{"$f":"IF($D$8=\"By Rows\",\"B4\",\"H2\")","v":"H2"}]
[null,{"$f":"IF($D$8=\"By Rows\",\"B5\",\"A3\")","v":"A3"}]
[null,{"$f":"IF($D$8=\"By Rows\",\"B6\",\"B3\")","v":"B3"}]
[null,{"$f":"IF($D$8=\"By Rows\",\"B7\",\"C3\")","v":"C3"}]
[null,{"$f":"IF($D$8=\"By Rows\",\"B8\",\"D3\")","v":"D3"}]
[null,{"$f":"IF($D$8=\"By Rows\",\"B9\",\"E3\")","v":"E3"}]
[null,{"$f":"IF($D$8=\"By Rows\",\"B10\",\"F3\")","v":"F3"}]
[null,{"$f":"IF($D$8=\"By Rows\",\"B11\",\"G3\")","v":"G3"}]
[null,{"$f":"IF($D$8=\"By Rows\",\"B12\",\"H3\")","v":"H3"}]
[null,{"$f":"IF($D$8=\"By Rows\",\"C1\",\"A4\")","v":"A4"}]
[null,{"$f":"IF($D$8=\"By Rows\",\"C2\",\"B4\")","v":"B4"}]
[null,{"$f":"IF($D$8=\"By Rows\",\"C3\",\"C4\")","v":"C4"}]
[null,{"$f":"IF($D$8=\"By Rows\",\"C4\",\"D4\")","v":"D4"}]
[null,{"$f":"IF($D$8=\"By Rows\",\"C5\",\"E4\")","v":"E4"}]
[null,{"$f":"IF($D$8=\"By Rows\",\"C6\",\"F4\")","v":"F4"}]
[null,{"$f":"IF($D$8=\"By Rows\",\"C7\",\"G4\")","v":"G4"}]
[null,{"$f":"IF($D$8=\"By Rows\",\"C8\",\"H4\")","v":"H4"}]
[null,{"$f":"IF($D$8=\"By Rows\",\"C9\",\"A5\")","v":"A5"}]
[null,{"$f":"IF($D$8=\"By Rows\",\"C10\",\"B5\")","v":"B5"}]
[null,{"$f":"IF($D$8=\"By Rows\",\"C11\",\"C5\")","v":"C5"}]
[null,{"$f":"IF($D$8=\"By Rows\",\"C12\",\"D5\")","v":"D5"}]
[null,{"$f":"IF($D$8=\"By Rows\",\"D1\",\"E5\")","v":"E5"}]
[null,{"$f":"IF($D$8=\"By Rows\",\"D2\",\"F5\")","v":"F5"}]
[null,{"$f":"IF($D$8=\"By Rows\",\"D3\",\"G5\")","v":"G5"}]
[null,{"$f":"IF($D$8=\"By Rows\",\"D4\",\"H5\")","v":"H5"}]
[null,{"$f":"IF($D$8=\"By Rows\",\"D5\",\"A6\")","v":"A6"}]
[null,{"$f":"IF($D$8=\"By Rows\",\"D6\",\"B6\")","v":"B6"}]
[null,{"$f":"IF($D$8=\"By Rows\",\"D7\",\"C6\")","v":"C6"}]
[null,{"$f":"IF($D$8=\"By Rows\",\"D8\",\"D6\")","v":"D6"}]
[null,{"$f":"IF($D$8=\"By Rows\",\"D9\",\"E6\")","v":"E6"}]
[null,{"$f":"IF($D$8=\"By Rows\",\"D10\",\"F6\")","v":"F6"}]
[null,{"$f":"IF($D$8=\"By Rows\",\"D11\",\"G6\")","v":"G6"}]
[null,{"$f":"IF($D$8=\"By Rows\",\"D12\",\"H6\")","v":"H6"}]
[null,{"$f":"IF($D$8=\"By Rows\",\"E1\",\"A7\")","v":"A7"}]
[null,{"$f":"IF($D$8=\"By Rows\",\"E2\",\"B7\")","v":"B7"}]
[null,{"$f":"IF($D$8=\"By Rows\",\"E3\",\"C7\")","v":"C7"}]
[null,{"$f":"IF($D$8=\"By Rows\",\"E4\",\"D7\")","v":"D7"}]
[null,{"$f":"IF($D$8=\"By Rows\",\"E5\",\"E7\")","v":"E7"}]
[null,{"$f":"IF($D$8=\"By Rows\",\"E6\",\"F7\")","v":"F7"}]
[null,{"$f":"IF($D$8=\"By Rows\",\"E7\",\"G7\")","v":"G7"}]
[null,{"$f":"IF($D$8=\"By Rows\",\"E8\",\"H7\")","v":"H7"}]
[null,{"$f":"IF($D$8=\"By Rows\",\"E9\",\"A8\")","v":"A8"}]
[null,{"$f":"IF($D$8=\"By Rows\",\"E10\",\"B8\")","v":"B8"}]
[null,{"$f":"IF($D$8=\"By Rows\",\"E11\",\"C8\")","v":"C8"}]
[null,{"$f":"IF($D$8=\"By Rows\",\"E12\",\"D8\")","v":"D8"}]
[null,{"$f":"IF($D$8=\"By Rows\",\"F1\",\"E8\")","v":"E8"}]
[null,{"$f":"IF($D$8=\"By Rows\",\"F2\",\"F8\")","v":"F8"}]
[null,{"$f":"IF($D$8=\"By Rows\",\"F3\",\"G8\")","v":"G8"}]
[null,{"$f":"IF($D$8=\"By Rows\",\"F4\",\"H8\")","v":"H8"}]
[null,{"$f":"IF($D$8=\"By Rows\",\"F5\",\"A9\")","v":"A9"}]
[null,{"$f":"IF($D$8=\"By Rows\",\"F6\",\"B9\")","v":"B9"}]
[null,{"$f":"IF($D$8=\"By Rows\",\"F7\",\"C9\")","v":"C9"}]
[null,{"$f":"IF($D$8=\"By Rows\",\"F8\",\"D9\")","v":"D9"}]
[null,{"$f":"IF($D$8=\"By Rows\",\"F9\",\"E9\")","v":"E9"}]
[null,{"$f":"IF($D$8=\"By Rows\",\"F10\",\"F9\")","v":"F9"}]
[null,{"$f":"IF($D$8=\"By Rows\",\"F11\",\"G9\")","v":"G9"}]
[null,{"$f":"IF($D$8=\"By Rows\",\"F12\",\"H9\")","v":"H9"}]
[null,{"$f":"IF($D$8=\"By Rows\",\"G1\",\"A10\")","v":"A10"}]
[null,{"$f":"IF($D$8=\"By Rows\",\"G2\",\"B10\")","v":"B10"}]
[null,{"$f":"IF($D$8=\"By Rows\",\"G3\",\"C10\")","v":"C10"}]
[null,{"$f":"IF($D$8=\"By Rows\",\"G4\",\"D10\")","v":"D10"}]
[null,{"$f":"IF($D$8=\"By Rows\",\"G5\",\"E10\")","v":"E10"}]
[null,{"$f":"IF($D$8=\"By Rows\",\"G6\",\"F10\")","v":"F10"}]
[null,{"$f":"IF($D$8=\"By Rows\",\"G7\",\"G10\")","v":"G10"}]
[null,{"$f":"IF($D$8=\"By Rows\",\"G8\",\"H10\")","v":"H10"}]
[null,{"$f":"IF($D$8=\"By Rows\",\"G9\",\"A11\")","v":"A11"}]
[null,{"$f":"IF($D$8=\"By Rows\",\"G10\",\"B11\")","v":"B11"}]
[null,{"$f":"IF($D$8=\"By Rows\",\"G11\",\"C11\")","v":"C11"}]
[null,{"$f":"IF($D$8=\"By Rows\",\"G12\",\"D11\")","v":"D11"}]
[null,{"$f":"IF($D$8=\"By Rows\",\"H1\",\"E11\")","v":"E11"}]
[null,{"$f":"IF($D$8=\"By Rows\",\"H2\",\"F11\")","v":"F11"}]
[null,{"$f":"IF($D$8=\"By Rows\",\"H3\",\"G11\")","v":"G11"}]
[null,{"$f":"IF($D$8=\"By Rows\",\"H4\",\"H11\")","v":"H11"}]
[null,{"$f":"IF($D$8=\"By Rows\",\"H5\",\"A12\")","v":"A12"}]
[null,{"$f":"IF($D$8=\"By Rows\",\"H6\",\"B12\")","v":"B12"}]
[null,{"$f":"IF($D$8=\"By Rows\",\"H7\",\"C12\")","v":"C12"}]
[null,{"$f":"IF($D$8=\"By Rows\",\"H8\",\"D12\")","v":"D12"}]
[null,{"$f":"IF($D$8=\"By Rows\",\"H9\",\"E12\")","v":"E12"}]
[null,{"$f":"IF($D$8=\"By Rows\",\"H10\",\"F12\")","v":"F12"}]
[null,{"$f":"IF($D$8=\"By Rows\",\"H11\",\"G12\")","v":"G12"}]
[null,"H12"]
[]
["We strongly recommend leaving the two reserved wells empty for internal quality control purposes. However, if you include your own samples in the reserved wells as well, we will not be able to evaluate the quality of the generated sequence data.",null,null,null,null,null,null,"© Eurofins Genomics"]

{"sheet":"Plate 11","index":13,"n_rows":110,"n_cols":11,"rows_kept":110,"cut":false,"hidden":false,"merged":[[1,6,1,7],[2,6,2,7],[3,6,3,7],[4,6,4,7],[109,0,112,6]]}
[]
[null,null,"Plate Information",null,null,"Tools ","Requirements"]
[null,null,"Plate Barcode:",null,null,null,"You must enter/select a primer name"]
[null,null,"*Sample Type:",null,null,"Help Page","Reserved for Control Samples"]
[null,null,"Add. Service:",null,null,null," *24 or more Samples/plate"]
[null,null,"*Advanced Options:","Standard"]
[null,null,"Template Specification:"]
[null,null,"*Plate Layout:","By Columns"]
[]
[]
[]
[null,"Well Position","*Sample Name","Primer 1","Sequence to synthesize or Barcode for enclosed primers","Primer 2","Sequence to synthesize or Barcode for enclosed primers","Primer 3","Sequence to synthesize or Barcode for enclosed primers","Primer 4","Sequence to synthesize or Barcode for enclosed primers"]
[null,"A1"]
[null,{"$f":"IF($D$8=\"By Rows\",\"A2\",\"B1\")","v":"B1"}]
[null,{"$f":"IF($D$8=\"By Rows\",\"A3\",\"C1\")","v":"C1"}]
[null,{"$f":"IF($D$8=\"By Rows\",\"A4\",\"D1\")","v":"D1"}]
[null,{"$f":"IF($D$8=\"By Rows\",\"A5\",\"E1\")","v":"E1"}]
[null,{"$f":"IF($D$8=\"By Rows\",\"A6\",\"F1\")","v":"F1"}]
[null,{"$f":"IF($D$8=\"By Rows\",\"A7\",\"G1\")","v":"G1"}]
[null,{"$f":"IF($D$8=\"By Rows\",\"A8\",\"H1\")","v":"H1"}]
[null,{"$f":"IF($D$8=\"By Rows\",\"A9\",\"A2\")","v":"A2"}]
[null,{"$f":"IF($D$8=\"By Rows\",\"A10\",\"B2\")","v":"B2"}]
[null,{"$f":"IF($D$8=\"By Rows\",\"A11\",\"C2\")","v":"C2"}]
[null,{"$f":"IF($D$8=\"By Rows\",\"A12\",\"D2\")","v":"D2"}]
[null,{"$f":"IF($D$8=\"By Rows\",\"B1\",\"E2\")","v":"E2"}]
[null,{"$f":"IF($D$8=\"By Rows\",\"B2\",\"F2\")","v":"F2"}]
[null,{"$f":"IF($D$8=\"By Rows\",\"B3\",\"G2\")","v":"G2"}]
[null,{"$f":"IF($D$8=\"By Rows\",\"B4\",\"H2\")","v":"H2"}]
[null,{"$f":"IF($D$8=\"By Rows\",\"B5\",\"A3\")","v":"A3"}]
[null,{"$f":"IF($D$8=\"By Rows\",\"B6\",\"B3\")","v":"B3"}]
[null,{"$f":"IF($D$8=\"By Rows\",\"B7\",\"C3\")","v":"C3"}]
[null,{"$f":"IF($D$8=\"By Rows\",\"B8\",\"D3\")","v":"D3"}]
[null,{"$f":"IF($D$8=\"By Rows\",\"B9\",\"E3\")","v":"E3"}]
[null,{"$f":"IF($D$8=\"By Rows\",\"B10\",\"F3\")","v":"F3"}]
[null,{"$f":"IF($D$8=\"By Rows\",\"B11\",\"G3\")","v":"G3"}]
[null,{"$f":"IF($D$8=\"By Rows\",\"B12\",\"H3\")","v":"H3"}]
[null,{"$f":"IF($D$8=\"By Rows\",\"C1\",\"A4\")","v":"A4"}]
[null,{"$f":"IF($D$8=\"By Rows\",\"C2\",\"B4\")","v":"B4"}]
[null,{"$f":"IF($D$8=\"By Rows\",\"C3\",\"C4\")","v":"C4"}]
[null,{"$f":"IF($D$8=\"By Rows\",\"C4\",\"D4\")","v":"D4"}]
[null,{"$f":"IF($D$8=\"By Rows\",\"C5\",\"E4\")","v":"E4"}]
[null,{"$f":"IF($D$8=\"By Rows\",\"C6\",\"F4\")","v":"F4"}]
[null,{"$f":"IF($D$8=\"By Rows\",\"C7\",\"G4\")","v":"G4"}]
[null,{"$f":"IF($D$8=\"By Rows\",\"C8\",\"H4\")","v":"H4"}]
[null,{"$f":"IF($D$8=\"By Rows\",\"C9\",\"A5\")","v":"A5"}]
[null,{"$f":"IF($D$8=\"By Rows\",\"C10\",\"B5\")","v":"B5"}]
[null,{"$f":"IF($D$8=\"By Rows\",\"C11\",\"C5\")","v":"C5"}]
[null,{"$f":"IF($D$8=\"By Rows\",\"C12\",\"D5\")","v":"D5"}]
[null,{"$f":"IF($D$8=\"By Rows\",\"D1\",\"E5\")","v":"E5"}]
[null,{"$f":"IF($D$8=\"By Rows\",\"D2\",\"F5\")","v":"F5"}]
[null,{"$f":"IF($D$8=\"By Rows\",\"D3\",\"G5\")","v":"G5"}]
[null,{"$f":"IF($D$8=\"By Rows\",\"D4\",\"H5\")","v":"H5"}]
[null,{"$f":"IF($D$8=\"By Rows\",\"D5\",\"A6\")","v":"A6"}]
[null,{"$f":"IF($D$8=\"By Rows\",\"D6\",\"B6\")","v":"B6"}]
[null,{"$f":"IF($D$8=\"By Rows\",\"D7\",\"C6\")","v":"C6"}]
[null,{"$f":"IF($D$8=\"By Rows\",\"D8\",\"D6\")","v":"D6"}]
[null,{"$f":"IF($D$8=\"By Rows\",\"D9\",\"E6\")","v":"E6"}]
[null,{"$f":"IF($D$8=\"By Rows\",\"D10\",\"F6\")","v":"F6"}]
[null,{"$f":"IF($D$8=\"By Rows\",\"D11\",\"G6\")","v":"G6"}]
[null,{"$f":"IF($D$8=\"By Rows\",\"D12\",\"H6\")","v":"H6"}]
[null,{"$f":"IF($D$8=\"By Rows\",\"E1\",\"A7\")","v":"A7"}]
[null,{"$f":"IF($D$8=\"By Rows\",\"E2\",\"B7\")","v":"B7"}]
[null,{"$f":"IF($D$8=\"By Rows\",\"E3\",\"C7\")","v":"C7"}]
[null,{"$f":"IF($D$8=\"By Rows\",\"E4\",\"D7\")","v":"D7"}]
[null,{"$f":"IF($D$8=\"By Rows\",\"E5\",\"E7\")","v":"E7"}]
[null,{"$f":"IF($D$8=\"By Rows\",\"E6\",\"F7\")","v":"F7"}]
[null,{"$f":"IF($D$8=\"By Rows\",\"E7\",\"G7\")","v":"G7"}]
[null,{"$f":"IF($D$8=\"By Rows\",\"E8\",\"H7\")","v":"H7"}]
[null,{"$f":"IF($D$8=\"By Rows\",\"E9\",\"A8\")","v":"A8"}]
[null,{"$f":"IF($D$8=\"By Rows\",\"E10\",\"B8\")","v":"B8"}]
[null,{"$f":"IF($D$8=\"By Rows\",\"E11\",\"C8\")","v":"C8"}]
[null,{"$f":"IF($D$8=\"By Rows\",\"E12\",\"D8\")","v":"D8"}]
[null,{"$f":"IF($D$8=\"By Rows\",\"F1\",\"E8\")","v":"E8"}]
[null,{"$f":"IF($D$8=\"By Rows\",\"F2\",\"F8\")","v":"F8"}]
[null,{"$f":"IF($D$8=\"By Rows\",\"F3\",\"G8\")","v":"G8"}]
[null,{"$f":"IF($D$8=\"By Rows\",\"F4\",\"H8\")","v":"H8"}]
[null,{"$f":"IF($D$8=\"By Rows\",\"F5\",\"A9\")","v":"A9"}]
[null,{"$f":"IF($D$8=\"By Rows\",\"F6\",\"B9\")","v":"B9"}]
[null,{"$f":"IF($D$8=\"By Rows\",\"F7\",\"C9\")","v":"C9"}]
[null,{"$f":"IF($D$8=\"By Rows\",\"F8\",\"D9\")","v":"D9"}]
[null,{"$f":"IF($D$8=\"By Rows\",\"F9\",\"E9\")","v":"E9"}]
[null,{"$f":"IF($D$8=\"By Rows\",\"F10\",\"F9\")","v":"F9"}]
[null,{"$f":"IF($D$8=\"By Rows\",\"F11\",\"G9\")","v":"G9"}]
[null,{"$f":"IF($D$8=\"By Rows\",\"F12\",\"H9\")","v":"H9"}]
[null,{"$f":"IF($D$8=\"By Rows\",\"G1\",\"A10\")","v":"A10"}]
[null,{"$f":"IF($D$8=\"By Rows\",\"G2\",\"B10\")","v":"B10"}]
[null,{"$f":"IF($D$8=\"By Rows\",\"G3\",\"C10\")","v":"C10"}]
[null,{"$f":"IF($D$8=\"By Rows\",\"G4\",\"D10\")","v":"D10"}]
[null,{"$f":"IF($D$8=\"By Rows\",\"G5\",\"E10\")","v":"E10"}]
[null,{"$f":"IF($D$8=\"By Rows\",\"G6\",\"F10\")","v":"F10"}]
[null,{"$f":"IF($D$8=\"By Rows\",\"G7\",\"G10\")","v":"G10"}]
[null,{"$f":"IF($D$8=\"By Rows\",\"G8\",\"H10\")","v":"H10"}]
[null,{"$f":"IF($D$8=\"By Rows\",\"G9\",\"A11\")","v":"A11"}]
[null,{"$f":"IF($D$8=\"By Rows\",\"G10\",\"B11\")","v":"B11"}]
[null,{"$f":"IF($D$8=\"By Rows\",\"G11\",\"C11\")","v":"C11"}]
[null,{"$f":"IF($D$8=\"By Rows\",\"G12\",\"D11\")","v":"D11"}]
[null,{"$f":"IF($D$8=\"By Rows\",\"H1\",\"E11\")","v":"E11"}]
[null,{"$f":"IF($D$8=\"By Rows\",\"H2\",\"F11\")","v":"F11"}]
[null,{"$f":"IF($D$8=\"By Rows\",\"H3\",\"G11\")","v":"G11"}]
[null,{"$f":"IF($D$8=\"By Rows\",\"H4\",\"H11\")","v":"H11"}]
[null,{"$f":"IF($D$8=\"By Rows\",\"H5\",\"A12\")","v":"A12"}]
[null,{"$f":"IF($D$8=\"By Rows\",\"H6\",\"B12\")","v":"B12"}]
[null,{"$f":"IF($D$8=\"By Rows\",\"H7\",\"C12\")","v":"C12"}]
[null,{"$f":"IF($D$8=\"By Rows\",\"H8\",\"D12\")","v":"D12"}]
[null,{"$f":"IF($D$8=\"By Rows\",\"H9\",\"E12\")","v":"E12"}]
[null,{"$f":"IF($D$8=\"By Rows\",\"H10\",\"F12\")","v":"F12"}]
[null,{"$f":"IF($D$8=\"By Rows\",\"H11\",\"G12\")","v":"G12"}]
[null,"H12"]
[]
["We strongly recommend leaving the two reserved wells empty for internal quality control purposes. However, if you include your own samples in the reserved wells as well, we will not be able to evaluate the quality of the generated sequence data.",null,null,null,null,null,null,"© Eurofins Genomics"]

{"sheet":"Plate 12","index":14,"n_rows":110,"n_cols":11,"rows_kept":110,"cut":false,"hidden":false,"merged":[[1,6,1,7],[2,6,2,7],[3,6,3,7],[4,6,4,7],[109,0,112,6]]}
[]
[null,null,"Plate Information",null,null,"Tools ","Requirements"]
[null,null,"Plate Barcode:",null,null,null,"You must enter/select a primer name"]
[null,null,"*Sample Type:",null,null,"Help Page","Reserved for Control Samples"]
[null,null,"Add. Service:",null,null,null," *24 or more Samples/plate"]
[null,null,"*Advanced Options:","Standard"]
[null,null,"Template Specification:"]
[null,null,"*Plate Layout:","By Columns"]
[]
[]
[]
[null,"Well Position","*Sample Name","Primer 1","Sequence to synthesize or Barcode for enclosed primers","Primer 2","Sequence to synthesize or Barcode for enclosed primers","Primer 3","Sequence to synthesize or Barcode for enclosed primers","Primer 4","Sequence to synthesize or Barcode for enclosed primers"]
[null,"A1"]
[null,{"$f":"IF($D$8=\"By Rows\",\"A2\",\"B1\")","v":"B1"}]
[null,{"$f":"IF($D$8=\"By Rows\",\"A3\",\"C1\")","v":"C1"}]
[null,{"$f":"IF($D$8=\"By Rows\",\"A4\",\"D1\")","v":"D1"}]
[null,{"$f":"IF($D$8=\"By Rows\",\"A5\",\"E1\")","v":"E1"}]
[null,{"$f":"IF($D$8=\"By Rows\",\"A6\",\"F1\")","v":"F1"}]
[null,{"$f":"IF($D$8=\"By Rows\",\"A7\",\"G1\")","v":"G1"}]
[null,{"$f":"IF($D$8=\"By Rows\",\"A8\",\"H1\")","v":"H1"}]
[null,{"$f":"IF($D$8=\"By Rows\",\"A9\",\"A2\")","v":"A2"}]
[null,{"$f":"IF($D$8=\"By Rows\",\"A10\",\"B2\")","v":"B2"}]
[null,{"$f":"IF($D$8=\"By Rows\",\"A11\",\"C2\")","v":"C2"}]
[null,{"$f":"IF($D$8=\"By Rows\",\"A12\",\"D2\")","v":"D2"}]
[null,{"$f":"IF($D$8=\"By Rows\",\"B1\",\"E2\")","v":"E2"}]
[null,{"$f":"IF($D$8=\"By Rows\",\"B2\",\"F2\")","v":"F2"}]
[null,{"$f":"IF($D$8=\"By Rows\",\"B3\",\"G2\")","v":"G2"}]
[null,{"$f":"IF($D$8=\"By Rows\",\"B4\",\"H2\")","v":"H2"}]
[null,{"$f":"IF($D$8=\"By Rows\",\"B5\",\"A3\")","v":"A3"}]
[null,{"$f":"IF($D$8=\"By Rows\",\"B6\",\"B3\")","v":"B3"}]
[null,{"$f":"IF($D$8=\"By Rows\",\"B7\",\"C3\")","v":"C3"}]
[null,{"$f":"IF($D$8=\"By Rows\",\"B8\",\"D3\")","v":"D3"}]
[null,{"$f":"IF($D$8=\"By Rows\",\"B9\",\"E3\")","v":"E3"}]
[null,{"$f":"IF($D$8=\"By Rows\",\"B10\",\"F3\")","v":"F3"}]
[null,{"$f":"IF($D$8=\"By Rows\",\"B11\",\"G3\")","v":"G3"}]
[null,{"$f":"IF($D$8=\"By Rows\",\"B12\",\"H3\")","v":"H3"}]
[null,{"$f":"IF($D$8=\"By Rows\",\"C1\",\"A4\")","v":"A4"}]
[null,{"$f":"IF($D$8=\"By Rows\",\"C2\",\"B4\")","v":"B4"}]
[null,{"$f":"IF($D$8=\"By Rows\",\"C3\",\"C4\")","v":"C4"}]
[null,{"$f":"IF($D$8=\"By Rows\",\"C4\",\"D4\")","v":"D4"}]
[null,{"$f":"IF($D$8=\"By Rows\",\"C5\",\"E4\")","v":"E4"}]
[null,{"$f":"IF($D$8=\"By Rows\",\"C6\",\"F4\")","v":"F4"}]
[null,{"$f":"IF($D$8=\"By Rows\",\"C7\",\"G4\")","v":"G4"}]
[null,{"$f":"IF($D$8=\"By Rows\",\"C8\",\"H4\")","v":"H4"}]
[null,{"$f":"IF($D$8=\"By Rows\",\"C9\",\"A5\")","v":"A5"}]
[null,{"$f":"IF($D$8=\"By Rows\",\"C10\",\"B5\")","v":"B5"}]
[null,{"$f":"IF($D$8=\"By Rows\",\"C11\",\"C5\")","v":"C5"}]
[null,{"$f":"IF($D$8=\"By Rows\",\"C12\",\"D5\")","v":"D5"}]
[null,{"$f":"IF($D$8=\"By Rows\",\"D1\",\"E5\")","v":"E5"}]
[null,{"$f":"IF($D$8=\"By Rows\",\"D2\",\"F5\")","v":"F5"}]
[null,{"$f":"IF($D$8=\"By Rows\",\"D3\",\"G5\")","v":"G5"}]
[null,{"$f":"IF($D$8=\"By Rows\",\"D4\",\"H5\")","v":"H5"}]
[null,{"$f":"IF($D$8=\"By Rows\",\"D5\",\"A6\")","v":"A6"}]
[null,{"$f":"IF($D$8=\"By Rows\",\"D6\",\"B6\")","v":"B6"}]
[null,{"$f":"IF($D$8=\"By Rows\",\"D7\",\"C6\")","v":"C6"}]
[null,{"$f":"IF($D$8=\"By Rows\",\"D8\",\"D6\")","v":"D6"}]
[null,{"$f":"IF($D$8=\"By Rows\",\"D9\",\"E6\")","v":"E6"}]
[null,{"$f":"IF($D$8=\"By Rows\",\"D10\",\"F6\")","v":"F6"}]
[null,{"$f":"IF($D$8=\"By Rows\",\"D11\",\"G6\")","v":"G6"}]
[null,{"$f":"IF($D$8=\"By Rows\",\"D12\",\"H6\")","v":"H6"}]
[null,{"$f":"IF($D$8=\"By Rows\",\"E1\",\"A7\")","v":"A7"}]
[null,{"$f":"IF($D$8=\"By Rows\",\"E2\",\"B7\")","v":"B7"}]
[null,{"$f":"IF($D$8=\"By Rows\",\"E3\",\"C7\")","v":"C7"}]
[null,{"$f":"IF($D$8=\"By Rows\",\"E4\",\"D7\")","v":"D7"}]
[null,{"$f":"IF($D$8=\"By Rows\",\"E5\",\"E7\")","v":"E7"}]
[null,{"$f":"IF($D$8=\"By Rows\",\"E6\",\"F7\")","v":"F7"}]
[null,{"$f":"IF($D$8=\"By Rows\",\"E7\",\"G7\")","v":"G7"}]
[null,{"$f":"IF($D$8=\"By Rows\",\"E8\",\"H7\")","v":"H7"}]
[null,{"$f":"IF($D$8=\"By Rows\",\"E9\",\"A8\")","v":"A8"}]
[null,{"$f":"IF($D$8=\"By Rows\",\"E10\",\"B8\")","v":"B8"}]
[null,{"$f":"IF($D$8=\"By Rows\",\"E11\",\"C8\")","v":"C8"}]
[null,{"$f":"IF($D$8=\"By Rows\",\"E12\",\"D8\")","v":"D8"}]
[null,{"$f":"IF($D$8=\"By Rows\",\"F1\",\"E8\")","v":"E8"}]
[null,{"$f":"IF($D$8=\"By Rows\",\"F2\",\"F8\")","v":"F8"}]
[null,{"$f":"IF($D$8=\"By Rows\",\"F3\",\"G8\")","v":"G8"}]
[null,{"$f":"IF($D$8=\"By Rows\",\"F4\",\"H8\")","v":"H8"}]
[null,{"$f":"IF($D$8=\"By Rows\",\"F5\",\"A9\")","v":"A9"}]
[null,{"$f":"IF($D$8=\"By Rows\",\"F6\",\"B9\")","v":"B9"}]
[null,{"$f":"IF($D$8=\"By Rows\",\"F7\",\"C9\")","v":"C9"}]
[null,{"$f":"IF($D$8=\"By Rows\",\"F8\",\"D9\")","v":"D9"}]
[null,{"$f":"IF($D$8=\"By Rows\",\"F9\",\"E9\")","v":"E9"}]
[null,{"$f":"IF($D$8=\"By Rows\",\"F10\",\"F9\")","v":"F9"}]
[null,{"$f":"IF($D$8=\"By Rows\",\"F11\",\"G9\")","v":"G9"}]
[null,{"$f":"IF($D$8=\"By Rows\",\"F12\",\"H9\")","v":"H9"}]
[null,{"$f":"IF($D$8=\"By Rows\",\"G1\",\"A10\")","v":"A10"}]
[null,{"$f":"IF($D$8=\"By Rows\",\"G2\",\"B10\")","v":"B10"}]
[null,{"$f":"IF($D$8=\"By Rows\",\"G3\",\"C10\")","v":"C10"}]
[null,{"$f":"IF($D$8=\"By Rows\",\"G4\",\"D10\")","v":"D10"}]
[null,{"$f":"IF($D$8=\"By Rows\",\"G5\",\"E10\")","v":"E10"}]
[null,{"$f":"IF($D$8=\"By Rows\",\"G6\",\"F10\")","v":"F10"}]
[null,{"$f":"IF($D$8=\"By Rows\",\"G7\",\"G10\")","v":"G10"}]
[null,{"$f":"IF($D$8=\"By Rows\",\"G8\",\"H10\")","v":"H10"}]
[null,{"$f":"IF($D$8=\"By Rows\",\"G9\",\"A11\")","v":"A11"}]
[null,{"$f":"IF($D$8=\"By Rows\",\"G10\",\"B11\")","v":"B11"}]
[null,{"$f":"IF($D$8=\"By Rows\",\"G11\",\"C11\")","v":"C11"}]
[null,{"$f":"IF($D$8=\"By Rows\",\"G12\",\"D11\")","v":"D11"}]
[null,{"$f":"IF($D$8=\"By Rows\",\"H1\",\"E11\")","v":"E11"}]
[null,{"$f":"IF($D$8=\"By Rows\",\"H2\",\"F11\")","v":"F11"}]
[null,{"$f":"IF($D$8=\"By Rows\",\"H3\",\"G11\")","v":"G11"}]
[null,{"$f":"IF($D$8=\"By Rows\",\"H4\",\"H11\")","v":"H11"}]
[null,{"$f":"IF($D$8=\"By Rows\",\"H5\",\"A12\")","v":"A12"}]
[null,{"$f":"IF($D$8=\"By Rows\",\"H6\",\"B12\")","v":"B12"}]
[null,{"$f":"IF($D$8=\"By Rows\",\"H7\",\"C12\")","v":"C12"}]
[null,{"$f":"IF($D$8=\"By Rows\",\"H8\",\"D12\")","v":"D12"}]
[null,{"$f":"IF($D$8=\"By Rows\",\"H9\",\"E12\")","v":"E12"}]
[null,{"$f":"IF($D$8=\"By Rows\",\"H10\",\"F12\")","v":"F12"}]
[null,{"$f":"IF($D$8=\"By Rows\",\"H11\",\"G12\")","v":"G12"}]
[null,"H12"]
[]
["We strongly recommend leaving the two reserved wells empty for internal quality control purposes. However, if you include your own samples in the reserved wells as well, we will not be able to evaluate the quality of the generated sequence data.",null,null,null,null,null,null,"© Eurofins Genomics"]

{"sheet":"Plate 13","index":15,"n_rows":110,"n_cols":11,"rows_kept":110,"cut":false,"hidden":false,"merged":[[1,6,1,7],[2,6,2,7],[3,6,3,7],[4,6,4,7],[109,0,112,6]]}
[]
[null,null,"Plate Information",null,null,"Tools ","Requirements"]
[null,null,"Plate Barcode:",null,null,null,"You must enter/select a primer name"]
[null,null,"*Sample Type:",null,null,"Help Page","Reserved for Control Samples"]
[null,null,"Add. Service:",null,null,null," *24 or more Samples/plate"]
[null,null,"*Advanced Options:","Standard"]
[null,null,"Template Specification:"]
[null,null,"*Plate Layout:","By Columns"]
[]
[]
[]
[null,"Well Position","*Sample Name","Primer 1","Sequence to synthesize or Barcode for enclosed primers","Primer 2","Sequence to synthesize or Barcode for enclosed primers","Primer 3","Sequence to synthesize or Barcode for enclosed primers","Primer 4","Sequence to synthesize or Barcode for enclosed primers"]
[null,"A1"]
[null,{"$f":"IF($D$8=\"By Rows\",\"A2\",\"B1\")","v":"B1"}]
[null,{"$f":"IF($D$8=\"By Rows\",\"A3\",\"C1\")","v":"C1"}]
[null,{"$f":"IF($D$8=\"By Rows\",\"A4\",\"D1\")","v":"D1"}]
[null,{"$f":"IF($D$8=\"By Rows\",\"A5\",\"E1\")","v":"E1"}]
[null,{"$f":"IF($D$8=\"By Rows\",\"A6\",\"F1\")","v":"F1"}]
[null,{"$f":"IF($D$8=\"By Rows\",\"A7\",\"G1\")","v":"G1"}]
[null,{"$f":"IF($D$8=\"By Rows\",\"A8\",\"H1\")","v":"H1"}]
[null,{"$f":"IF($D$8=\"By Rows\",\"A9\",\"A2\")","v":"A2"}]
[null,{"$f":"IF($D$8=\"By Rows\",\"A10\",\"B2\")","v":"B2"}]
[null,{"$f":"IF($D$8=\"By Rows\",\"A11\",\"C2\")","v":"C2"}]
[null,{"$f":"IF($D$8=\"By Rows\",\"A12\",\"D2\")","v":"D2"}]
[null,{"$f":"IF($D$8=\"By Rows\",\"B1\",\"E2\")","v":"E2"}]
[null,{"$f":"IF($D$8=\"By Rows\",\"B2\",\"F2\")","v":"F2"}]
[null,{"$f":"IF($D$8=\"By Rows\",\"B3\",\"G2\")","v":"G2"}]
[null,{"$f":"IF($D$8=\"By Rows\",\"B4\",\"H2\")","v":"H2"}]
[null,{"$f":"IF($D$8=\"By Rows\",\"B5\",\"A3\")","v":"A3"}]
[null,{"$f":"IF($D$8=\"By Rows\",\"B6\",\"B3\")","v":"B3"}]
[null,{"$f":"IF($D$8=\"By Rows\",\"B7\",\"C3\")","v":"C3"}]
[null,{"$f":"IF($D$8=\"By Rows\",\"B8\",\"D3\")","v":"D3"}]
[null,{"$f":"IF($D$8=\"By Rows\",\"B9\",\"E3\")","v":"E3"}]
[null,{"$f":"IF($D$8=\"By Rows\",\"B10\",\"F3\")","v":"F3"}]
[null,{"$f":"IF($D$8=\"By Rows\",\"B11\",\"G3\")","v":"G3"}]
[null,{"$f":"IF($D$8=\"By Rows\",\"B12\",\"H3\")","v":"H3"}]
[null,{"$f":"IF($D$8=\"By Rows\",\"C1\",\"A4\")","v":"A4"}]
[null,{"$f":"IF($D$8=\"By Rows\",\"C2\",\"B4\")","v":"B4"}]
[null,{"$f":"IF($D$8=\"By Rows\",\"C3\",\"C4\")","v":"C4"}]
[null,{"$f":"IF($D$8=\"By Rows\",\"C4\",\"D4\")","v":"D4"}]
[null,{"$f":"IF($D$8=\"By Rows\",\"C5\",\"E4\")","v":"E4"}]
[null,{"$f":"IF($D$8=\"By Rows\",\"C6\",\"F4\")","v":"F4"}]
[null,{"$f":"IF($D$8=\"By Rows\",\"C7\",\"G4\")","v":"G4"}]
[null,{"$f":"IF($D$8=\"By Rows\",\"C8\",\"H4\")","v":"H4"}]
[null,{"$f":"IF($D$8=\"By Rows\",\"C9\",\"A5\")","v":"A5"}]
[null,{"$f":"IF($D$8=\"By Rows\",\"C10\",\"B5\")","v":"B5"}]
[null,{"$f":"IF($D$8=\"By Rows\",\"C11\",\"C5\")","v":"C5"}]
[null,{"$f":"IF($D$8=\"By Rows\",\"C12\",\"D5\")","v":"D5"}]
[null,{"$f":"IF($D$8=\"By Rows\",\"D1\",\"E5\")","v":"E5"}]
[null,{"$f":"IF($D$8=\"By Rows\",\"D2\",\"F5\")","v":"F5"}]
[null,{"$f":"IF($D$8=\"By Rows\",\"D3\",\"G5\")","v":"G5"}]
[null,{"$f":"IF($D$8=\"By Rows\",\"D4\",\"H5\")","v":"H5"}]
[null,{"$f":"IF($D$8=\"By Rows\",\"D5\",\"A6\")","v":"A6"}]
[null,{"$f":"IF($D$8=\"By Rows\",\"D6\",\"B6\")","v":"B6"}]
[null,{"$f":"IF($D$8=\"By Rows\",\"D7\",\"C6\")","v":"C6"}]
[null,{"$f":"IF($D$8=\"By Rows\",\"D8\",\"D6\")","v":"D6"}]
[null,{"$f":"IF($D$8=\"By Rows\",\"D9\",\"E6\")","v":"E6"}]
[null,{"$f":"IF($D$8=\"By Rows\",\"D10\",\"F6\")","v":"F6"}]
[null,{"$f":"IF($D$8=\"By Rows\",\"D11\",\"G6\")","v":"G6"}]
[null,{"$f":"IF($D$8=\"By Rows\",\"D12\",\"H6\")","v":"H6"}]
[null,{"$f":"IF($D$8=\"By Rows\",\"E1\",\"A7\")","v":"A7"}]
[null,{"$f":"IF($D$8=\"By Rows\",\"E2\",\"B7\")","v":"B7"}]
[null,{"$f":"IF($D$8=\"By Rows\",\"E3\",\"C7\")","v":"C7"}]
[null,{"$f":"IF($D$8=\"By Rows\",\"E4\",\"D7\")","v":"D7"}]
[null,{"$f":"IF($D$8=\"By Rows\",\"E5\",\"E7\")","v":"E7"}]
[null,{"$f":"IF($D$8=\"By Rows\",\"E6\",\"F7\")","v":"F7"}]
[null,{"$f":"IF($D$8=\"By Rows\",\"E7\",\"G7\")","v":"G7"}]
[null,{"$f":"IF($D$8=\"By Rows\",\"E8\",\"H7\")","v":"H7"}]
[null,{"$f":"IF($D$8=\"By Rows\",\"E9\",\"A8\")","v":"A8"}]
[null,{"$f":"IF($D$8=\"By Rows\",\"E10\",\"B8\")","v":"B8"}]
[null,{"$f":"IF($D$8=\"By Rows\",\"E11\",\"C8\")","v":"C8"}]
[null,{"$f":"IF($D$8=\"By Rows\",\"E12\",\"D8\")","v":"D8"}]
[null,{"$f":"IF($D$8=\"By Rows\",\"F1\",\"E8\")","v":"E8"}]
[null,{"$f":"IF($D$8=\"By Rows\",\"F2\",\"F8\")","v":"F8"}]
[null,{"$f":"IF($D$8=\"By Rows\",\"F3\",\"G8\")","v":"G8"}]
[null,{"$f":"IF($D$8=\"By Rows\",\"F4\",\"H8\")","v":"H8"}]
[null,{"$f":"IF($D$8=\"By Rows\",\"F5\",\"A9\")","v":"A9"}]
[null,{"$f":"IF($D$8=\"By Rows\",\"F6\",\"B9\")","v":"B9"}]
[null,{"$f":"IF($D$8=\"By Rows\",\"F7\",\"C9\")","v":"C9"}]
[null,{"$f":"IF($D$8=\"By Rows\",\"F8\",\"D9\")","v":"D9"}]
[null,{"$f":"IF($D$8=\"By Rows\",\"F9\",\"E9\")","v":"E9"}]
[null,{"$f":"IF($D$8=\"By Rows\",\"F10\",\"F9\")","v":"F9"}]
[null,{"$f":"IF($D$8=\"By Rows\",\"F11\",\"G9\")","v":"G9"}]
[null,{"$f":"IF($D$8=\"By Rows\",\"F12\",\"H9\")","v":"H9"}]
[null,{"$f":"IF($D$8=\"By Rows\",\"G1\",\"A10\")","v":"A10"}]
[null,{"$f":"IF($D$8=\"By Rows\",\"G2\",\"B10\")","v":"B10"}]
[null,{"$f":"IF($D$8=\"By Rows\",\"G3\",\"C10\")","v":"C10"}]
[null,{"$f":"IF($D$8=\"By Rows\",\"G4\",\"D10\")","v":"D10"}]
[null,{"$f":"IF($D$8=\"By Rows\",\"G5\",\"E10\")","v":"E10"}]
[null,{"$f":"IF($D$8=\"By Rows\",\"G6\",\"F10\")","v":"F10"}]
[null,{"$f":"IF($D$8=\"By Rows\",\"G7\",\"G10\")","v":"G10"}]
[null,{"$f":"IF($D$8=\"By Rows\",\"G8\",\"H10\")","v":"H10"}]
[null,{"$f":"IF($D$8=\"By Rows\",\"G9\",\"A11\")","v":"A11"}]
[null,{"$f":"IF($D$8=\"By Rows\",\"G10\",\"B11\")","v":"B11"}]
[null,{"$f":"IF($D$8=\"By Rows\",\"G11\",\"C11\")","v":"C11"}]
[null,{"$f":"IF($D$8=\"By Rows\",\"G12\",\"D11\")","v":"D11"}]
[null,{"$f":"IF($D$8=\"By Rows\",\"H1\",\"E11\")","v":"E11"}]
[null,{"$f":"IF($D$8=\"By Rows\",\"H2\",\"F11\")","v":"F11"}]
[null,{"$f":"IF($D$8=\"By Rows\",\"H3\",\"G11\")","v":"G11"}]
[null,{"$f":"IF($D$8=\"By Rows\",\"H4\",\"H11\")","v":"H11"}]
[null,{"$f":"IF($D$8=\"By Rows\",\"H5\",\"A12\")","v":"A12"}]
[null,{"$f":"IF($D$8=\"By Rows\",\"H6\",\"B12\")","v":"B12"}]
[null,{"$f":"IF($D$8=\"By Rows\",\"H7\",\"C12\")","v":"C12"}]
[null,{"$f":"IF($D$8=\"By Rows\",\"H8\",\"D12\")","v":"D12"}]
[null,{"$f":"IF($D$8=\"By Rows\",\"H9\",\"E12\")","v":"E12"}]
[null,{"$f":"IF($D$8=\"By Rows\",\"H10\",\"F12\")","v":"F12"}]
[null,{"$f":"IF($D$8=\"By Rows\",\"H11\",\"G12\")","v":"G12"}]
[null,"H12"]
[]
["We strongly recommend leaving the two reserved wells empty for internal quality control purposes. However, if you include your own samples in the reserved wells as well, we will not be able to evaluate the quality of the generated sequence data.",null,null,null,null,null,null,"© Eurofins Genomics"]

{"sheet":"Plate 14","index":16,"n_rows":110,"n_cols":11,"rows_kept":110,"cut":false,"hidden":false,"merged":[[1,6,1,7],[2,6,2,7],[3,6,3,7],[4,6,4,7],[109,0,112,6]]}
[]
[null,null,"Plate Information",null,null,"Tools ","Requirements"]
[null,null,"Plate Barcode:",null,null,null,"You must enter/select a primer name"]
[null,null,"*Sample Type:",null,null,"Help Page","Reserved for Control Samples"]
[null,null,"Add. Service:",null,null,null," *24 or more Samples/plate"]
[null,null,"*Advanced Options:","Standard"]
[null,null,"Template Specification:"]
[null,null,"*Plate Layout:","By Columns"]
[]
[]
[]
[null,"Well Position","*Sample Name","Primer 1","Sequence to synthesize or Barcode for enclosed primers","Primer 2","Sequence to synthesize or Barcode for enclosed primers","Primer 3","Sequence to synthesize or Barcode for enclosed primers","Primer 4","Sequence to synthesize or Barcode for enclosed primers"]
[null,"A1"]
[null,{"$f":"IF($D$8=\"By Rows\",\"A2\",\"B1\")","v":"B1"}]
[null,{"$f":"IF($D$8=\"By Rows\",\"A3\",\"C1\")","v":"C1"}]
[null,{"$f":"IF($D$8=\"By Rows\",\"A4\",\"D1\")","v":"D1"}]
[null,{"$f":"IF($D$8=\"By Rows\",\"A5\",\"E1\")","v":"E1"}]
[null,{"$f":"IF($D$8=\"By Rows\",\"A6\",\"F1\")","v":"F1"}]
[null,{"$f":"IF($D$8=\"By Rows\",\"A7\",\"G1\")","v":"G1"}]
[null,{"$f":"IF($D$8=\"By Rows\",\"A8\",\"H1\")","v":"H1"}]
[null,{"$f":"IF($D$8=\"By Rows\",\"A9\",\"A2\")","v":"A2"}]
[null,{"$f":"IF($D$8=\"By Rows\",\"A10\",\"B2\")","v":"B2"}]
[null,{"$f":"IF($D$8=\"By Rows\",\"A11\",\"C2\")","v":"C2"}]
[null,{"$f":"IF($D$8=\"By Rows\",\"A12\",\"D2\")","v":"D2"}]
[null,{"$f":"IF($D$8=\"By Rows\",\"B1\",\"E2\")","v":"E2"}]
[null,{"$f":"IF($D$8=\"By Rows\",\"B2\",\"F2\")","v":"F2"}]
[null,{"$f":"IF($D$8=\"By Rows\",\"B3\",\"G2\")","v":"G2"}]
[null,{"$f":"IF($D$8=\"By Rows\",\"B4\",\"H2\")","v":"H2"}]
[null,{"$f":"IF($D$8=\"By Rows\",\"B5\",\"A3\")","v":"A3"}]
[null,{"$f":"IF($D$8=\"By Rows\",\"B6\",\"B3\")","v":"B3"}]
[null,{"$f":"IF($D$8=\"By Rows\",\"B7\",\"C3\")","v":"C3"}]
[null,{"$f":"IF($D$8=\"By Rows\",\"B8\",\"D3\")","v":"D3"}]
[null,{"$f":"IF($D$8=\"By Rows\",\"B9\",\"E3\")","v":"E3"}]
[null,{"$f":"IF($D$8=\"By Rows\",\"B10\",\"F3\")","v":"F3"}]
[null,{"$f":"IF($D$8=\"By Rows\",\"B11\",\"G3\")","v":"G3"}]
[null,{"$f":"IF($D$8=\"By Rows\",\"B12\",\"H3\")","v":"H3"}]
[null,{"$f":"IF($D$8=\"By Rows\",\"C1\",\"A4\")","v":"A4"}]
[null,{"$f":"IF($D$8=\"By Rows\",\"C2\",\"B4\")","v":"B4"}]
[null,{"$f":"IF($D$8=\"By Rows\",\"C3\",\"C4\")","v":"C4"}]
[null,{"$f":"IF($D$8=\"By Rows\",\"C4\",\"D4\")","v":"D4"}]
[null,{"$f":"IF($D$8=\"By Rows\",\"C5\",\"E4\")","v":"E4"}]
[null,{"$f":"IF($D$8=\"By Rows\",\"C6\",\"F4\")","v":"F4"}]
[null,{"$f":"IF($D$8=\"By Rows\",\"C7\",\"G4\")","v":"G4"}]
[null,{"$f":"IF($D$8=\"By Rows\",\"C8\",\"H4\")","v":"H4"}]
[null,{"$f":"IF($D$8=\"By Rows\",\"C9\",\"A5\")","v":"A5"}]
[null,{"$f":"IF($D$8=\"By Rows\",\"C10\",\"B5\")","v":"B5"}]
[null,{"$f":"IF($D$8=\"By Rows\",\"C11\",\"C5\")","v":"C5"}]
[null,{"$f":"IF($D$8=\"By Rows\",\"C12\",\"D5\")","v":"D5"}]
[null,{"$f":"IF($D$8=\"By Rows\",\"D1\",\"E5\")","v":"E5"}]
[null,{"$f":"IF($D$8=\"By Rows\",\"D2\",\"F5\")","v":"F5"}]
[null,{"$f":"IF($D$8=\"By Rows\",\"D3\",\"G5\")","v":"G5"}]
[null,{"$f":"IF($D$8=\"By Rows\",\"D4\",\"H5\")","v":"H5"}]
[null,{"$f":"IF($D$8=\"By Rows\",\"D5\",\"A6\")","v":"A6"}]
[null,{"$f":"IF($D$8=\"By Rows\",\"D6\",\"B6\")","v":"B6"}]
[null,{"$f":"IF($D$8=\"By Rows\",\"D7\",\"C6\")","v":"C6"}]
[null,{"$f":"IF($D$8=\"By Rows\",\"D8\",\"D6\")","v":"D6"}]
[null,{"$f":"IF($D$8=\"By Rows\",\"D9\",\"E6\")","v":"E6"}]
[null,{"$f":"IF($D$8=\"By Rows\",\"D10\",\"F6\")","v":"F6"}]
[null,{"$f":"IF($D$8=\"By Rows\",\"D11\",\"G6\")","v":"G6"}]
[null,{"$f":"IF($D$8=\"By Rows\",\"D12\",\"H6\")","v":"H6"}]
[null,{"$f":"IF($D$8=\"By Rows\",\"E1\",\"A7\")","v":"A7"}]
[null,{"$f":"IF($D$8=\"By Rows\",\"E2\",\"B7\")","v":"B7"}]
[null,{"$f":"IF($D$8=\"By Rows\",\"E3\",\"C7\")","v":"C7"}]
[null,{"$f":"IF($D$8=\"By Rows\",\"E4\",\"D7\")","v":"D7"}]
[null,{"$f":"IF($D$8=\"By Rows\",\"E5\",\"E7\")","v":"E7"}]
[null,{"$f":"IF($D$8=\"By Rows\",\"E6\",\"F7\")","v":"F7"}]
[null,{"$f":"IF($D$8=\"By Rows\",\"E7\",\"G7\")","v":"G7"}]
[null,{"$f":"IF($D$8=\"By Rows\",\"E8\",\"H7\")","v":"H7"}]
[null,{"$f":"IF($D$8=\"By Rows\",\"E9\",\"A8\")","v":"A8"}]
[null,{"$f":"IF($D$8=\"By Rows\",\"E10\",\"B8\")","v":"B8"}]
[null,{"$f":"IF($D$8=\"By Rows\",\"E11\",\"C8\")","v":"C8"}]
[null,{"$f":"IF($D$8=\"By Rows\",\"E12\",\"D8\")","v":"D8"}]
[null,{"$f":"IF($D$8=\"By Rows\",\"F1\",\"E8\")","v":"E8"}]
[null,{"$f":"IF($D$8=\"By Rows\",\"F2\",\"F8\")","v":"F8"}]
[null,{"$f":"IF($D$8=\"By Rows\",\"F3\",\"G8\")","v":"G8"}]
[null,{"$f":"IF($D$8=\"By Rows\",\"F4\",\"H8\")","v":"H8"}]
[null,{"$f":"IF($D$8=\"By Rows\",\"F5\",\"A9\")","v":"A9"}]
[null,{"$f":"IF($D$8=\"By Rows\",\"F6\",\"B9\")","v":"B9"}]
[null,{"$f":"IF($D$8=\"By Rows\",\"F7\",\"C9\")","v":"C9"}]
[null,{"$f":"IF($D$8=\"By Rows\",\"F8\",\"D9\")","v":"D9"}]
[null,{"$f":"IF($D$8=\"By Rows\",\"F9\",\"E9\")","v":"E9"}]
[null,{"$f":"IF($D$8=\"By Rows\",\"F10\",\"F9\")","v":"F9"}]
[null,{"$f":"IF($D$8=\"By Rows\",\"F11\",\"G9\")","v":"G9"}]
[null,{"$f":"IF($D$8=\"By Rows\",\"F12\",\"H9\")","v":"H9"}]
[null,{"$f":"IF($D$8=\"By Rows\",\"G1\",\"A10\")","v":"A10"}]
[null,{"$f":"IF($D$8=\"By Rows\",\"G2\",\"B10\")","v":"B10"}]
[null,{"$f":"IF($D$8=\"By Rows\",\"G3\",\"C10\")","v":"C10"}]
[null,{"$f":"IF($D$8=\"By Rows\",\"G4\",\"D10\")","v":"D10"}]
[null,{"$f":"IF($D$8=\"By Rows\",\"G5\",\"E10\")","v":"E10"}]
[null,{"$f":"IF($D$8=\"By Rows\",\"G6\",\"F10\")","v":"F10"}]
[null,{"$f":"IF($D$8=\"By Rows\",\"G7\",\"G10\")","v":"G10"}]
[null,{"$f":"IF($D$8=\"By Rows\",\"G8\",\"H10\")","v":"H10"}]
[null,{"$f":"IF($D$8=\"By Rows\",\"G9\",\"A11\")","v":"A11"}]
[null,{"$f":"IF($D$8=\"By Rows\",\"G10\",\"B11\")","v":"B11"}]
[null,{"$f":"IF($D$8=\"By Rows\",\"G11\",\"C11\")","v":"C11"}]
[null,{"$f":"IF($D$8=\"By Rows\",\"G12\",\"D11\")","v":"D11"}]
[null,{"$f":"IF($D$8=\"By Rows\",\"H1\",\"E11\")","v":"E11"}]
[null,{"$f":"IF($D$8=\"By Rows\",\"H2\",\"F11\")","v":"F11"}]
[null,{"$f":"IF($D$8=\"By Rows\",\"H3\",\"G11\")","v":"G11"}]
[null,{"$f":"IF($D$8=\"By Rows\",\"H4\",\"H11\")","v":"H11"}]
[null,{"$f":"IF($D$8=\"By Rows\",\"H5\",\"A12\")","v":"A12"}]
[null,{"$f":"IF($D$8=\"By Rows\",\"H6\",\"B12\")","v":"B12"}]
[null,{"$f":"IF($D$8=\"By Rows\",\"H7\",\"C12\")","v":"C12"}]
[null,{"$f":"IF($D$8=\"By Rows\",\"H8\",\"D12\")","v":"D12"}]
[null,{"$f":"IF($D$8=\"By Rows\",\"H9\",\"E12\")","v":"E12"}]
[null,{"$f":"IF($D$8=\"By Rows\",\"H10\",\"F12\")","v":"F12"}]
[null,{"$f":"IF($D$8=\"By Rows\",\"H11\",\"G12\")","v":"G12"}]
[null,"H12"]
[]
["We strongly recommend leaving the two reserved wells empty for internal quality control purposes. However, if you include your own samples in the reserved wells as well, we will not be able to evaluate the quality of the generated sequence data.",null,null,null,null,null,null,"© Eurofins Genomics"]

{"sheet":"Plate 15","index":17,"n_rows":110,"n_cols":11,"rows_kept":110,"cut":false,"hidden":false,"merged":[[1,6,1,7],[2,6,2,7],[3,6,3,7],[4,6,4,7],[109,0,112,6]]}
[]
[null,null,"Plate Information",null,null,"Tools ","Requirements"]
[null,null,"Plate Barcode:",null,null,null,"You must enter/select a primer name"]
[null,null,"*Sample Type:",null,null,"Help Page","Reserved for Control Samples"]
[null,null,"Add. Service:",null,null,null," *24 or more Samples/plate"]
[null,null,"*Advanced Options:","Standard"]
[null,null,"Template Specification:"]
[null,null,"*Plate Layout:","By Columns"]
[]
[]
[]
[null,"Well Position","*Sample Name","Primer 1","Sequence to synthesize or Barcode for enclosed primers","Primer 2","Sequence to synthesize or Barcode for enclosed primers","Primer 3","Sequence to synthesize or Barcode for enclosed primers","Primer 4","Sequence to synthesize or Barcode for enclosed primers"]
[null,"A1"]
[null,{"$f":"IF($D$8=\"By Rows\",\"A2\",\"B1\")","v":"B1"}]
[null,{"$f":"IF($D$8=\"By Rows\",\"A3\",\"C1\")","v":"C1"}]
[null,{"$f":"IF($D$8=\"By Rows\",\"A4\",\"D1\")","v":"D1"}]
[null,{"$f":"IF($D$8=\"By Rows\",\"A5\",\"E1\")","v":"E1"}]
[null,{"$f":"IF($D$8=\"By Rows\",\"A6\",\"F1\")","v":"F1"}]
[null,{"$f":"IF($D$8=\"By Rows\",\"A7\",\"G1\")","v":"G1"}]
[null,{"$f":"IF($D$8=\"By Rows\",\"A8\",\"H1\")","v":"H1"}]
[null,{"$f":"IF($D$8=\"By Rows\",\"A9\",\"A2\")","v":"A2"}]
[null,{"$f":"IF($D$8=\"By Rows\",\"A10\",\"B2\")","v":"B2"}]
[null,{"$f":"IF($D$8=\"By Rows\",\"A11\",\"C2\")","v":"C2"}]
[null,{"$f":"IF($D$8=\"By Rows\",\"A12\",\"D2\")","v":"D2"}]
[null,{"$f":"IF($D$8=\"By Rows\",\"B1\",\"E2\")","v":"E2"}]
[null,{"$f":"IF($D$8=\"By Rows\",\"B2\",\"F2\")","v":"F2"}]
[null,{"$f":"IF($D$8=\"By Rows\",\"B3\",\"G2\")","v":"G2"}]
[null,{"$f":"IF($D$8=\"By Rows\",\"B4\",\"H2\")","v":"H2"}]
[null,{"$f":"IF($D$8=\"By Rows\",\"B5\",\"A3\")","v":"A3"}]
[null,{"$f":"IF($D$8=\"By Rows\",\"B6\",\"B3\")","v":"B3"}]
[null,{"$f":"IF($D$8=\"By Rows\",\"B7\",\"C3\")","v":"C3"}]
[null,{"$f":"IF($D$8=\"By Rows\",\"B8\",\"D3\")","v":"D3"}]
[null,{"$f":"IF($D$8=\"By Rows\",\"B9\",\"E3\")","v":"E3"}]
[null,{"$f":"IF($D$8=\"By Rows\",\"B10\",\"F3\")","v":"F3"}]
[null,{"$f":"IF($D$8=\"By Rows\",\"B11\",\"G3\")","v":"G3"}]
[null,{"$f":"IF($D$8=\"By Rows\",\"B12\",\"H3\")","v":"H3"}]
[null,{"$f":"IF($D$8=\"By Rows\",\"C1\",\"A4\")","v":"A4"}]
[null,{"$f":"IF($D$8=\"By Rows\",\"C2\",\"B4\")","v":"B4"}]
[null,{"$f":"IF($D$8=\"By Rows\",\"C3\",\"C4\")","v":"C4"}]
[null,{"$f":"IF($D$8=\"By Rows\",\"C4\",\"D4\")","v":"D4"}]
[null,{"$f":"IF($D$8=\"By Rows\",\"C5\",\"E4\")","v":"E4"}]
[null,{"$f":"IF($D$8=\"By Rows\",\"C6\",\"F4\")","v":"F4"}]
[null,{"$f":"IF($D$8=\"By Rows\",\"C7\",\"G4\")","v":"G4"}]
[null,{"$f":"IF($D$8=\"By Rows\",\"C8\",\"H4\")","v":"H4"}]
[null,{"$f":"IF($D$8=\"By Rows\",\"C9\",\"A5\")","v":"A5"}]
[null,{"$f":"IF($D$8=\"By Rows\",\"C10\",\"B5\")","v":"B5"}]
[null,{"$f":"IF($D$8=\"By Rows\",\"C11\",\"C5\")","v":"C5"}]
[null,{"$f":"IF($D$8=\"By Rows\",\"C12\",\"D5\")","v":"D5"}]
[null,{"$f":"IF($D$8=\"By Rows\",\"D1\",\"E5\")","v":"E5"}]
[null,{"$f":"IF($D$8=\"By Rows\",\"D2\",\"F5\")","v":"F5"}]
[null,{"$f":"IF($D$8=\"By Rows\",\"D3\",\"G5\")","v":"G5"}]
[null,{"$f":"IF($D$8=\"By Rows\",\"D4\",\"H5\")","v":"H5"}]
[null,{"$f":"IF($D$8=\"By Rows\",\"D5\",\"A6\")","v":"A6"}]
[null,{"$f":"IF($D$8=\"By Rows\",\"D6\",\"B6\")","v":"B6"}]
[null,{"$f":"IF($D$8=\"By Rows\",\"D7\",\"C6\")","v":"C6"}]
[null,{"$f":"IF($D$8=\"By Rows\",\"D8\",\"D6\")","v":"D6"}]
[null,{"$f":"IF($D$8=\"By Rows\",\"D9\",\"E6\")","v":"E6"}]
[null,{"$f":"IF($D$8=\"By Rows\",\"D10\",\"F6\")","v":"F6"}]
[null,{"$f":"IF($D$8=\"By Rows\",\"D11\",\"G6\")","v":"G6"}]
[null,{"$f":"IF($D$8=\"By Rows\",\"D12\",\"H6\")","v":"H6"}]
[null,{"$f":"IF($D$8=\"By Rows\",\"E1\",\"A7\")","v":"A7"}]
[null,{"$f":"IF($D$8=\"By Rows\",\"E2\",\"B7\")","v":"B7"}]
[null,{"$f":"IF($D$8=\"By Rows\",\"E3\",\"C7\")","v":"C7"}]
[null,{"$f":"IF($D$8=\"By Rows\",\"E4\",\"D7\")","v":"D7"}]
[null,{"$f":"IF($D$8=\"By Rows\",\"E5\",\"E7\")","v":"E7"}]
[null,{"$f":"IF($D$8=\"By Rows\",\"E6\",\"F7\")","v":"F7"}]
[null,{"$f":"IF($D$8=\"By Rows\",\"E7\",\"G7\")","v":"G7"}]
[null,{"$f":"IF($D$8=\"By Rows\",\"E8\",\"H7\")","v":"H7"}]
[null,{"$f":"IF($D$8=\"By Rows\",\"E9\",\"A8\")","v":"A8"}]
[null,{"$f":"IF($D$8=\"By Rows\",\"E10\",\"B8\")","v":"B8"}]
[null,{"$f":"IF($D$8=\"By Rows\",\"E11\",\"C8\")","v":"C8"}]
[null,{"$f":"IF($D$8=\"By Rows\",\"E12\",\"D8\")","v":"D8"}]
[null,{"$f":"IF($D$8=\"By Rows\",\"F1\",\"E8\")","v":"E8"}]
[null,{"$f":"IF($D$8=\"By Rows\",\"F2\",\"F8\")","v":"F8"}]
[null,{"$f":"IF($D$8=\"By Rows\",\"F3\",\"G8\")","v":"G8"}]
[null,{"$f":"IF($D$8=\"By Rows\",\"F4\",\"H8\")","v":"H8"}]
[null,{"$f":"IF($D$8=\"By Rows\",\"F5\",\"A9\")","v":"A9"}]
[null,{"$f":"IF($D$8=\"By Rows\",\"F6\",\"B9\")","v":"B9"}]
[null,{"$f":"IF($D$8=\"By Rows\",\"F7\",\"C9\")","v":"C9"}]
[null,{"$f":"IF($D$8=\"By Rows\",\"F8\",\"D9\")","v":"D9"}]
[null,{"$f":"IF($D$8=\"By Rows\",\"F9\",\"E9\")","v":"E9"}]
[null,{"$f":"IF($D$8=\"By Rows\",\"F10\",\"F9\")","v":"F9"}]
[null,{"$f":"IF($D$8=\"By Rows\",\"F11\",\"G9\")","v":"G9"}]
[null,{"$f":"IF($D$8=\"By Rows\",\"F12\",\"H9\")","v":"H9"}]
[null,{"$f":"IF($D$8=\"By Rows\",\"G1\",\"A10\")","v":"A10"}]
[null,{"$f":"IF($D$8=\"By Rows\",\"G2\",\"B10\")","v":"B10"}]
[null,{"$f":"IF($D$8=\"By Rows\",\"G3\",\"C10\")","v":"C10"}]
[null,{"$f":"IF($D$8=\"By Rows\",\"G4\",\"D10\")","v":"D10"}]
[null,{"$f":"IF($D$8=\"By Rows\",\"G5\",\"E10\")","v":"E10"}]
[null,{"$f":"IF($D$8=\"By Rows\",\"G6\",\"F10\")","v":"F10"}]
[null,{"$f":"IF($D$8=\"By Rows\",\"G7\",\"G10\")","v":"G10"}]
[null,{"$f":"IF($D$8=\"By Rows\",\"G8\",\"H10\")","v":"H10"}]
[null,{"$f":"IF($D$8=\"By Rows\",\"G9\",\"A11\")","v":"A11"}]
[null,{"$f":"IF($D$8=\"By Rows\",\"G10\",\"B11\")","v":"B11"}]
[null,{"$f":"IF($D$8=\"By Rows\",\"G11\",\"C11\")","v":"C11"}]
[null,{"$f":"IF($D$8=\"By Rows\",\"G12\",\"D11\")","v":"D11"}]
[null,{"$f":"IF($D$8=\"By Rows\",\"H1\",\"E11\")","v":"E11"}]
[null,{"$f":"IF($D$8=\"By Rows\",\"H2\",\"F11\")","v":"F11"}]
[null,{"$f":"IF($D$8=\"By Rows\",\"H3\",\"G11\")","v":"G11"}]
[null,{"$f":"IF($D$8=\"By Rows\",\"H4\",\"H11\")","v":"H11"}]
[null,{"$f":"IF($D$8=\"By Rows\",\"H5\",\"A12\")","v":"A12"}]
[null,{"$f":"IF($D$8=\"By Rows\",\"H6\",\"B12\")","v":"B12"}]
[null,{"$f":"IF($D$8=\"By Rows\",\"H7\",\"C12\")","v":"C12"}]
[null,{"$f":"IF($D$8=\"By Rows\",\"H8\",\"D12\")","v":"D12"}]
[null,{"$f":"IF($D$8=\"By Rows\",\"H9\",\"E12\")","v":"E12"}]
[null,{"$f":"IF($D$8=\"By Rows\",\"H10\",\"F12\")","v":"F12"}]
[null,{"$f":"IF($D$8=\"By Rows\",\"H11\",\"G12\")","v":"G12"}]
[null,"H12"]
[]
["We strongly recommend leaving the two reserved wells empty for internal quality control purposes. However, if you include your own samples in the reserved wells as well, we will not be able to evaluate the quality of the generated sequence data.",null,null,null,null,null,null,"© Eurofins Genomics"]

{"sheet":"Plate 16","index":18,"n_rows":110,"n_cols":11,"rows_kept":110,"cut":false,"hidden":false,"merged":[[1,6,1,7],[2,6,2,7],[3,6,3,7],[4,6,4,7],[109,0,112,6]]}
[]
[null,null,"Plate Information",null,null,"Tools ","Requirements"]
[null,null,"Plate Barcode:",null,null,null,"You must enter/select a primer name"]
[null,null,"*Sample Type:",null,null,"Help Page","Reserved for Control Samples"]
[null,null,"Add. Service:",null,null,null," *24 or more Samples/plate"]
[null,null,"*Advanced Options:","Standard"]
[null,null,"Template Specification:"]
[null,null,"*Plate Layout:","By Columns"]
[]
[]
[]
[null,"Well Position","*Sample Name","Primer 1","Sequence to synthesize or Barcode for enclosed primers","Primer 2","Sequence to synthesize or Barcode for enclosed primers","Primer 3","Sequence to synthesize or Barcode for enclosed primers","Primer 4","Sequence to synthesize or Barcode for enclosed primers"]
[null,"A1"]
[null,{"$f":"IF($D$8=\"By Rows\",\"A2\",\"B1\")","v":"B1"}]
[null,{"$f":"IF($D$8=\"By Rows\",\"A3\",\"C1\")","v":"C1"}]
[null,{"$f":"IF($D$8=\"By Rows\",\"A4\",\"D1\")","v":"D1"}]
[null,{"$f":"IF($D$8=\"By Rows\",\"A5\",\"E1\")","v":"E1"}]
[null,{"$f":"IF($D$8=\"By Rows\",\"A6\",\"F1\")","v":"F1"}]
[null,{"$f":"IF($D$8=\"By Rows\",\"A7\",\"G1\")","v":"G1"}]
[null,{"$f":"IF($D$8=\"By Rows\",\"A8\",\"H1\")","v":"H1"}]
[null,{"$f":"IF($D$8=\"By Rows\",\"A9\",\"A2\")","v":"A2"}]
[null,{"$f":"IF($D$8=\"By Rows\",\"A10\",\"B2\")","v":"B2"}]
[null,{"$f":"IF($D$8=\"By Rows\",\"A11\",\"C2\")","v":"C2"}]
[null,{"$f":"IF($D$8=\"By Rows\",\"A12\",\"D2\")","v":"D2"}]
[null,{"$f":"IF($D$8=\"By Rows\",\"B1\",\"E2\")","v":"E2"}]
[null,{"$f":"IF($D$8=\"By Rows\",\"B2\",\"F2\")","v":"F2"}]
[null,{"$f":"IF($D$8=\"By Rows\",\"B3\",\"G2\")","v":"G2"}]
[null,{"$f":"IF($D$8=\"By Rows\",\"B4\",\"H2\")","v":"H2"}]
[null,{"$f":"IF($D$8=\"By Rows\",\"B5\",\"A3\")","v":"A3"}]
[null,{"$f":"IF($D$8=\"By Rows\",\"B6\",\"B3\")","v":"B3"}]
[null,{"$f":"IF($D$8=\"By Rows\",\"B7\",\"C3\")","v":"C3"}]
[null,{"$f":"IF($D$8=\"By Rows\",\"B8\",\"D3\")","v":"D3"}]
[null,{"$f":"IF($D$8=\"By Rows\",\"B9\",\"E3\")","v":"E3"}]
[null,{"$f":"IF($D$8=\"By Rows\",\"B10\",\"F3\")","v":"F3"}]
[null,{"$f":"IF($D$8=\"By Rows\",\"B11\",\"G3\")","v":"G3"}]
[null,{"$f":"IF($D$8=\"By Rows\",\"B12\",\"H3\")","v":"H3"}]
[null,{"$f":"IF($D$8=\"By Rows\",\"C1\",\"A4\")","v":"A4"}]
[null,{"$f":"IF($D$8=\"By Rows\",\"C2\",\"B4\")","v":"B4"}]
[null,{"$f":"IF($D$8=\"By Rows\",\"C3\",\"C4\")","v":"C4"}]
[null,{"$f":"IF($D$8=\"By Rows\",\"C4\",\"D4\")","v":"D4"}]
[null,{"$f":"IF($D$8=\"By Rows\",\"C5\",\"E4\")","v":"E4"}]
[null,{"$f":"IF($D$8=\"By Rows\",\"C6\",\"F4\")","v":"F4"}]
[null,{"$f":"IF($D$8=\"By Rows\",\"C7\",\"G4\")","v":"G4"}]
[null,{"$f":"IF($D$8=\"By Rows\",\"C8\",\"H4\")","v":"H4"}]
[null,{"$f":"IF($D$8=\"By Rows\",\"C9\",\"A5\")","v":"A5"}]
[null,{"$f":"IF($D$8=\"By Rows\",\"C10\",\"B5\")","v":"B5"}]
[null,{"$f":"IF($D$8=\"By Rows\",\"C11\",\"C5\")","v":"C5"}]
[null,{"$f":"IF($D$8=\"By Rows\",\"C12\",\"D5\")","v":"D5"}]
[null,{"$f":"IF($D$8=\"By Rows\",\"D1\",\"E5\")","v":"E5"}]
[null,{"$f":"IF($D$8=\"By Rows\",\"D2\",\"F5\")","v":"F5"}]
[null,{"$f":"IF($D$8=\"By Rows\",\"D3\",\"G5\")","v":"G5"}]
[null,{"$f":"IF($D$8=\"By Rows\",\"D4\",\"H5\")","v":"H5"}]
[null,{"$f":"IF($D$8=\"By Rows\",\"D5\",\"A6\")","v":"A6"}]
[null,{"$f":"IF($D$8=\"By Rows\",\"D6\",\"B6\")","v":"B6"}]
[null,{"$f":"IF($D$8=\"By Rows\",\"D7\",\"C6\")","v":"C6"}]
[null,{"$f":"IF($D$8=\"By Rows\",\"D8\",\"D6\")","v":"D6"}]
[null,{"$f":"IF($D$8=\"By Rows\",\"D9\",\"E6\")","v":"E6"}]
[null,{"$f":"IF($D$8=\"By Rows\",\"D10\",\"F6\")","v":"F6"}]
[null,{"$f":"IF($D$8=\"By Rows\",\"D11\",\"G6\")","v":"G6"}]
[null,{"$f":"IF($D$8=\"By Rows\",\"D12\",\"H6\")","v":"H6"}]
[null,{"$f":"IF($D$8=\"By Rows\",\"E1\",\"A7\")","v":"A7"}]
[null,{"$f":"IF($D$8=\"By Rows\",\"E2\",\"B7\")","v":"B7"}]
[null,{"$f":"IF($D$8=\"By Rows\",\"E3\",\"C7\")","v":"C7"}]
[null,{"$f":"IF($D$8=\"By Rows\",\"E4\",\"D7\")","v":"D7"}]
[null,{"$f":"IF($D$8=\"By Rows\",\"E5\",\"E7\")","v":"E7"}]
[null,{"$f":"IF($D$8=\"By Rows\",\"E6\",\"F7\")","v":"F7"}]
[null,{"$f":"IF($D$8=\"By Rows\",\"E7\",\"G7\")","v":"G7"}]
[null,{"$f":"IF($D$8=\"By Rows\",\"E8\",\"H7\")","v":"H7"}]
[null,{"$f":"IF($D$8=\"By Rows\",\"E9\",\"A8\")","v":"A8"}]
[null,{"$f":"IF($D$8=\"By Rows\",\"E10\",\"B8\")","v":"B8"}]
[null,{"$f":"IF($D$8=\"By Rows\",\"E11\",\"C8\")","v":"C8"}]
[null,{"$f":"IF($D$8=\"By Rows\",\"E12\",\"D8\")","v":"D8"}]
[null,{"$f":"IF($D$8=\"By Rows\",\"F1\",\"E8\")","v":"E8"}]
[null,{"$f":"IF($D$8=\"By Rows\",\"F2\",\"F8\")","v":"F8"}]
[null,{"$f":"IF($D$8=\"By Rows\",\"F3\",\"G8\")","v":"G8"}]
[null,{"$f":"IF($D$8=\"By Rows\",\"F4\",\"H8\")","v":"H8"}]
[null,{"$f":"IF($D$8=\"By Rows\",\"F5\",\"A9\")","v":"A9"}]
[null,{"$f":"IF($D$8=\"By Rows\",\"F6\",\"B9\")","v":"B9"}]
[null,{"$f":"IF($D$8=\"By Rows\",\"F7\",\"C9\")","v":"C9"}]
[null,{"$f":"IF($D$8=\"By Rows\",\"F8\",\"D9\")","v":"D9"}]
[null,{"$f":"IF($D$8=\"By Rows\",\"F9\",\"E9\")","v":"E9"}]
[null,{"$f":"IF($D$8=\"By Rows\",\"F10\",\"F9\")","v":"F9"}]
[null,{"$f":"IF($D$8=\"By Rows\",\"F11\",\"G9\")","v":"G9"}]
[null,{"$f":"IF($D$8=\"By Rows\",\"F12\",\"H9\")","v":"H9"}]
[null,{"$f":"IF($D$8=\"By Rows\",\"G1\",\"A10\")","v":"A10"}]
[null,{"$f":"IF($D$8=\"By Rows\",\"G2\",\"B10\")","v":"B10"}]
[null,{"$f":"IF($D$8=\"By Rows\",\"G3\",\"C10\")","v":"C10"}]
[null,{"$f":"IF($D$8=\"By Rows\",\"G4\",\"D10\")","v":"D10"}]
[null,{"$f":"IF($D$8=\"By Rows\",\"G5\",\"E10\")","v":"E10"}]
[null,{"$f":"IF($D$8=\"By Rows\",\"G6\",\"F10\")","v":"F10"}]
[null,{"$f":"IF($D$8=\"By Rows\",\"G7\",\"G10\")","v":"G10"}]
[null,{"$f":"IF($D$8=\"By Rows\",\"G8\",\"H10\")","v":"H10"}]
[null,{"$f":"IF($D$8=\"By Rows\",\"G9\",\"A11\")","v":"A11"}]
[null,{"$f":"IF($D$8=\"By Rows\",\"G10\",\"B11\")","v":"B11"}]
[null,{"$f":"IF($D$8=\"By Rows\",\"G11\",\"C11\")","v":"C11"}]
[null,{"$f":"IF($D$8=\"By Rows\",\"G12\",\"D11\")","v":"D11"}]
[null,{"$f":"IF($D$8=\"By Rows\",\"H1\",\"E11\")","v":"E11"}]
[null,{"$f":"IF($D$8=\"By Rows\",\"H2\",\"F11\")","v":"F11"}]
[null,{"$f":"IF($D$8=\"By Rows\",\"H3\",\"G11\")","v":"G11"}]
[null,{"$f":"IF($D$8=\"By Rows\",\"H4\",\"H11\")","v":"H11"}]
[null,{"$f":"IF($D$8=\"By Rows\",\"H5\",\"A12\")","v":"A12"}]
[null,{"$f":"IF($D$8=\"By Rows\",\"H6\",\"B12\")","v":"B12"}]
[null,{"$f":"IF($D$8=\"By Rows\",\"H7\",\"C12\")","v":"C12"}]
[null,{"$f":"IF($D$8=\"By Rows\",\"H8\",\"D12\")","v":"D12"}]
[null,{"$f":"IF($D$8=\"By Rows\",\"H9\",\"E12\")","v":"E12"}]
[null,{"$f":"IF($D$8=\"By Rows\",\"H10\",\"F12\")","v":"F12"}]
[null,{"$f":"IF($D$8=\"By Rows\",\"H11\",\"G12\")","v":"G12"}]
[null,"H12"]
[]
["We strongly recommend leaving the two reserved wells empty for internal quality control purposes. However, if you include your own samples in the reserved wells as well, we will not be able to evaluate the quality of the generated sequence data.",null,null,null,null,null,null,"© Eurofins Genomics"]

{"sheet":"Plate 17","index":19,"n_rows":110,"n_cols":11,"rows_kept":110,"cut":false,"hidden":false,"merged":[[1,6,1,7],[2,6,2,7],[3,6,3,7],[4,6,4,7],[109,0,112,6]]}
[]
[null,null,"Plate Information",null,null,"Tools ","Requirements"]
[null,null,"Plate Barcode:",null,null,null,"You must enter/select a primer name"]
[null,null,"*Sample Type:",null,null,"Help Page","Reserved for Control Samples"]
[null,null,"Add. Service:",null,null,null," *24 or more Samples/plate"]
[null,null,"*Advanced Options:","Standard"]
[null,null,"Template Specification:"]
[null,null,"*Plate Layout:","By Columns"]
[]
[]
[]
[null,"Well Position","*Sample Name","Primer 1","Sequence to synthesize or Barcode for enclosed primers","Primer 2","Sequence to synthesize or Barcode for enclosed primers","Primer 3","Sequence to synthesize or Barcode for enclosed primers","Primer 4","Sequence to synthesize or Barcode for enclosed primers"]
[null,"A1"]
[null,{"$f":"IF($D$8=\"By Rows\",\"A2\",\"B1\")","v":"B1"}]
[null,{"$f":"IF($D$8=\"By Rows\",\"A3\",\"C1\")","v":"C1"}]
[null,{"$f":"IF($D$8=\"By Rows\",\"A4\",\"D1\")","v":"D1"}]
[null,{"$f":"IF($D$8=\"By Rows\",\"A5\",\"E1\")","v":"E1"}]
[null,{"$f":"IF($D$8=\"By Rows\",\"A6\",\"F1\")","v":"F1"}]
[null,{"$f":"IF($D$8=\"By Rows\",\"A7\",\"G1\")","v":"G1"}]
[null,{"$f":"IF($D$8=\"By Rows\",\"A8\",\"H1\")","v":"H1"}]
[null,{"$f":"IF($D$8=\"By Rows\",\"A9\",\"A2\")","v":"A2"}]
[null,{"$f":"IF($D$8=\"By Rows\",\"A10\",\"B2\")","v":"B2"}]
[null,{"$f":"IF($D$8=\"By Rows\",\"A11\",\"C2\")","v":"C2"}]
[null,{"$f":"IF($D$8=\"By Rows\",\"A12\",\"D2\")","v":"D2"}]
[null,{"$f":"IF($D$8=\"By Rows\",\"B1\",\"E2\")","v":"E2"}]
[null,{"$f":"IF($D$8=\"By Rows\",\"B2\",\"F2\")","v":"F2"}]
[null,{"$f":"IF($D$8=\"By Rows\",\"B3\",\"G2\")","v":"G2"}]
[null,{"$f":"IF($D$8=\"By Rows\",\"B4\",\"H2\")","v":"H2"}]
[null,{"$f":"IF($D$8=\"By Rows\",\"B5\",\"A3\")","v":"A3"}]
[null,{"$f":"IF($D$8=\"By Rows\",\"B6\",\"B3\")","v":"B3"}]
[null,{"$f":"IF($D$8=\"By Rows\",\"B7\",\"C3\")","v":"C3"}]
[null,{"$f":"IF($D$8=\"By Rows\",\"B8\",\"D3\")","v":"D3"}]
[null,{"$f":"IF($D$8=\"By Rows\",\"B9\",\"E3\")","v":"E3"}]
[null,{"$f":"IF($D$8=\"By Rows\",\"B10\",\"F3\")","v":"F3"}]
[null,{"$f":"IF($D$8=\"By Rows\",\"B11\",\"G3\")","v":"G3"}]
[null,{"$f":"IF($D$8=\"By Rows\",\"B12\",\"H3\")","v":"H3"}]
[null,{"$f":"IF($D$8=\"By Rows\",\"C1\",\"A4\")","v":"A4"}]
[null,{"$f":"IF($D$8=\"By Rows\",\"C2\",\"B4\")","v":"B4"}]
[null,{"$f":"IF($D$8=\"By Rows\",\"C3\",\"C4\")","v":"C4"}]
[null,{"$f":"IF($D$8=\"By Rows\",\"C4\",\"D4\")","v":"D4"}]
[null,{"$f":"IF($D$8=\"By Rows\",\"C5\",\"E4\")","v":"E4"}]
[null,{"$f":"IF($D$8=\"By Rows\",\"C6\",\"F4\")","v":"F4"}]
[null,{"$f":"IF($D$8=\"By Rows\",\"C7\",\"G4\")","v":"G4"}]
[null,{"$f":"IF($D$8=\"By Rows\",\"C8\",\"H4\")","v":"H4"}]
[null,{"$f":"IF($D$8=\"By Rows\",\"C9\",\"A5\")","v":"A5"}]
[null,{"$f":"IF($D$8=\"By Rows\",\"C10\",\"B5\")","v":"B5"}]
[null,{"$f":"IF($D$8=\"By Rows\",\"C11\",\"C5\")","v":"C5"}]
[null,{"$f":"IF($D$8=\"By Rows\",\"C12\",\"D5\")","v":"D5"}]
[null,{"$f":"IF($D$8=\"By Rows\",\"D1\",\"E5\")","v":"E5"}]
[null,{"$f":"IF($D$8=\"By Rows\",\"D2\",\"F5\")","v":"F5"}]
[null,{"$f":"IF($D$8=\"By Rows\",\"D3\",\"G5\")","v":"G5"}]
[null,{"$f":"IF($D$8=\"By Rows\",\"D4\",\"H5\")","v":"H5"}]
[null,{"$f":"IF($D$8=\"By Rows\",\"D5\",\"A6\")","v":"A6"}]
[null,{"$f":"IF($D$8=\"By Rows\",\"D6\",\"B6\")","v":"B6"}]
[null,{"$f":"IF($D$8=\"By Rows\",\"D7\",\"C6\")","v":"C6"}]
[null,{"$f":"IF($D$8=\"By Rows\",\"D8\",\"D6\")","v":"D6"}]
[null,{"$f":"IF($D$8=\"By Rows\",\"D9\",\"E6\")","v":"E6"}]
[null,{"$f":"IF($D$8=\"By Rows\",\"D10\",\"F6\")","v":"F6"}]
[null,{"$f":"IF($D$8=\"By Rows\",\"D11\",\"G6\")","v":"G6"}]
[null,{"$f":"IF($D$8=\"By Rows\",\"D12\",\"H6\")","v":"H6"}]
[null,{"$f":"IF($D$8=\"By Rows\",\"E1\",\"A7\")","v":"A7"}]
[null,{"$f":"IF($D$8=\"By Rows\",\"E2\",\"B7\")","v":"B7"}]
[null,{"$f":"IF($D$8=\"By Rows\",\"E3\",\"C7\")","v":"C7"}]
[null,{"$f":"IF($D$8=\"By Rows\",\"E4\",\"D7\")","v":"D7"}]
[null,{"$f":"IF($D$8=\"By Rows\",\"E5\",\"E7\")","v":"E7"}]
[null,{"$f":"IF($D$8=\"By Rows\",\"E6\",\"F7\")","v":"F7"}]
[null,{"$f":"IF($D$8=\"By Rows\",\"E7\",\"G7\")","v":"G7"}]
[null,{"$f":"IF($D$8=\"By Rows\",\"E8\",\"H7\")","v":"H7"}]
[null,{"$f":"IF($D$8=\"By Rows\",\"E9\",\"A8\")","v":"A8"}]
[null,{"$f":"IF($D$8=\"By Rows\",\"E10\",\"B8\")","v":"B8"}]
[null,{"$f":"IF($D$8=\"By Rows\",\"E11\",\"C8\")","v":"C8"}]
[null,{"$f":"IF($D$8=\"By Rows\",\"E12\",\"D8\")","v":"D8"}]
[null,{"$f":"IF($D$8=\"By Rows\",\"F1\",\"E8\")","v":"E8"}]
[null,{"$f":"IF($D$8=\"By Rows\",\"F2\",\"F8\")","v":"F8"}]
[null,{"$f":"IF($D$8=\"By Rows\",\"F3\",\"G8\")","v":"G8"}]
[null,{"$f":"IF($D$8=\"By Rows\",\"F4\",\"H8\")","v":"H8"}]
[null,{"$f":"IF($D$8=\"By Rows\",\"F5\",\"A9\")","v":"A9"}]
[null,{"$f":"IF($D$8=\"By Rows\",\"F6\",\"B9\")","v":"B9"}]
[null,{"$f":"IF($D$8=\"By Rows\",\"F7\",\"C9\")","v":"C9"}]
[null,{"$f":"IF($D$8=\"By Rows\",\"F8\",\"D9\")","v":"D9"}]
[null,{"$f":"IF($D$8=\"By Rows\",\"F9\",\"E9\")","v":"E9"}]
[null,{"$f":"IF($D$8=\"By Rows\",\"F10\",\"F9\")","v":"F9"}]
[null,{"$f":"IF($D$8=\"By Rows\",\"F11\",\"G9\")","v":"G9"}]
[null,{"$f":"IF($D$8=\"By Rows\",\"F12\",\"H9\")","v":"H9"}]
[null,{"$f":"IF($D$8=\"By Rows\",\"G1\",\"A10\")","v":"A10"}]
[null,{"$f":"IF($D$8=\"By Rows\",\"G2\",\"B10\")","v":"B10"}]
[null,{"$f":"IF($D$8=\"By Rows\",\"G3\",\"C10\")","v":"C10"}]
[null,{"$f":"IF($D$8=\"By Rows\",\"G4\",\"D10\")","v":"D10"}]
[null,{"$f":"IF($D$8=\"By Rows\",\"G5\",\"E10\")","v":"E10"}]
[null,{"$f":"IF($D$8=\"By Rows\",\"G6\",\"F10\")","v":"F10"}]
[null,{"$f":"IF($D$8=\"By Rows\",\"G7\",\"G10\")","v":"G10"}]
[null,{"$f":"IF($D$8=\"By Rows\",\"G8\",\"H10\")","v":"H10"}]
[null,{"$f":"IF($D$8=\"By Rows\",\"G9\",\"A11\")","v":"A11"}]
[null,{"$f":"IF($D$8=\"By Rows\",\"G10\",\"B11\")","v":"B11"}]
[null,{"$f":"IF($D$8=\"By Rows\",\"G11\",\"C11\")","v":"C11"}]
[null,{"$f":"IF($D$8=\"By Rows\",\"G12\",\"D11\")","v":"D11"}]
[null,{"$f":"IF($D$8=\"By Rows\",\"H1\",\"E11\")","v":"E11"}]
[null,{"$f":"IF($D$8=\"By Rows\",\"H2\",\"F11\")","v":"F11"}]
[null,{"$f":"IF($D$8=\"By Rows\",\"H3\",\"G11\")","v":"G11"}]
[null,{"$f":"IF($D$8=\"By Rows\",\"H4\",\"H11\")","v":"H11"}]
[null,{"$f":"IF($D$8=\"By Rows\",\"H5\",\"A12\")","v":"A12"}]
[null,{"$f":"IF($D$8=\"By Rows\",\"H6\",\"B12\")","v":"B12"}]
[null,{"$f":"IF($D$8=\"By Rows\",\"H7\",\"C12\")","v":"C12"}]
[null,{"$f":"IF($D$8=\"By Rows\",\"H8\",\"D12\")","v":"D12"}]
[null,{"$f":"IF($D$8=\"By Rows\",\"H9\",\"E12\")","v":"E12"}]
[null,{"$f":"IF($D$8=\"By Rows\",\"H10\",\"F12\")","v":"F12"}]
[null,{"$f":"IF($D$8=\"By Rows\",\"H11\",\"G12\")","v":"G12"}]
[null,"H12"]
[]
["We strongly recommend leaving the two reserved wells empty for internal quality control purposes. However, if you include your own samples in the reserved wells as well, we will not be able to evaluate the quality of the generated sequence data.",null,null,null,null,null,null,"© Eurofins Genomics"]

{"sheet":"Plate 18","index":20,"n_rows":110,"n_cols":11,"rows_kept":110,"cut":false,"hidden":false,"merged":[[1,6,1,7],[2,6,2,7],[3,6,3,7],[4,6,4,7],[109,0,112,6]]}
[]
[null,null,"Plate Information",null,null,"Tools ","Requirements"]
[null,null,"Plate Barcode:",null,null,null,"You must enter/select a primer name"]
[null,null,"*Sample Type:",null,null,"Help Page","Reserved for Control Samples"]
[null,null,"Add. Service:",null,null,null," *24 or more Samples/plate"]
[null,null,"*Advanced Options:","Standard"]
[null,null,"Template Specification:"]
[null,null,"*Plate Layout:","By Columns"]
[]
[]
[]
[null,"Well Position","*Sample Name","Primer 1","Sequence to synthesize or Barcode for enclosed primers","Primer 2","Sequence to synthesize or Barcode for enclosed primers","Primer 3","Sequence to synthesize or Barcode for enclosed primers","Primer 4","Sequence to synthesize or Barcode for enclosed primers"]
[null,"A1"]
[null,{"$f":"IF($D$8=\"By Rows\",\"A2\",\"B1\")","v":"B1"}]
[null,{"$f":"IF($D$8=\"By Rows\",\"A3\",\"C1\")","v":"C1"}]
[null,{"$f":"IF($D$8=\"By Rows\",\"A4\",\"D1\")","v":"D1"}]
[null,{"$f":"IF($D$8=\"By Rows\",\"A5\",\"E1\")","v":"E1"}]
[null,{"$f":"IF($D$8=\"By Rows\",\"A6\",\"F1\")","v":"F1"}]
[null,{"$f":"IF($D$8=\"By Rows\",\"A7\",\"G1\")","v":"G1"}]
[null,{"$f":"IF($D$8=\"By Rows\",\"A8\",\"H1\")","v":"H1"}]
[null,{"$f":"IF($D$8=\"By Rows\",\"A9\",\"A2\")","v":"A2"}]
[null,{"$f":"IF($D$8=\"By Rows\",\"A10\",\"B2\")","v":"B2"}]
[null,{"$f":"IF($D$8=\"By Rows\",\"A11\",\"C2\")","v":"C2"}]
[null,{"$f":"IF($D$8=\"By Rows\",\"A12\",\"D2\")","v":"D2"}]
[null,{"$f":"IF($D$8=\"By Rows\",\"B1\",\"E2\")","v":"E2"}]
[null,{"$f":"IF($D$8=\"By Rows\",\"B2\",\"F2\")","v":"F2"}]
[null,{"$f":"IF($D$8=\"By Rows\",\"B3\",\"G2\")","v":"G2"}]
[null,{"$f":"IF($D$8=\"By Rows\",\"B4\",\"H2\")","v":"H2"}]
[null,{"$f":"IF($D$8=\"By Rows\",\"B5\",\"A3\")","v":"A3"}]
[null,{"$f":"IF($D$8=\"By Rows\",\"B6\",\"B3\")","v":"B3"}]
[null,{"$f":"IF($D$8=\"By Rows\",\"B7\",\"C3\")","v":"C3"}]
[null,{"$f":"IF($D$8=\"By Rows\",\"B8\",\"D3\")","v":"D3"}]
[null,{"$f":"IF($D$8=\"By Rows\",\"B9\",\"E3\")","v":"E3"}]
[null,{"$f":"IF($D$8=\"By Rows\",\"B10\",\"F3\")","v":"F3"}]
[null,{"$f":"IF($D$8=\"By Rows\",\"B11\",\"G3\")","v":"G3"}]
[null,{"$f":"IF($D$8=\"By Rows\",\"B12\",\"H3\")","v":"H3"}]
[null,{"$f":"IF($D$8=\"By Rows\",\"C1\",\"A4\")","v":"A4"}]
[null,{"$f":"IF($D$8=\"By Rows\",\"C2\",\"B4\")","v":"B4"}]
[null,{"$f":"IF($D$8=\"By Rows\",\"C3\",\"C4\")","v":"C4"}]
[null,{"$f":"IF($D$8=\"By Rows\",\"C4\",\"D4\")","v":"D4"}]
[null,{"$f":"IF($D$8=\"By Rows\",\"C5\",\"E4\")","v":"E4"}]
[null,{"$f":"IF($D$8=\"By Rows\",\"C6\",\"F4\")","v":"F4"}]
[null,{"$f":"IF($D$8=\"By Rows\",\"C7\",\"G4\")","v":"G4"}]
[null,{"$f":"IF($D$8=\"By Rows\",\"C8\",\"H4\")","v":"H4"}]
[null,{"$f":"IF($D$8=\"By Rows\",\"C9\",\"A5\")","v":"A5"}]
[null,{"$f":"IF($D$8=\"By Rows\",\"C10\",\"B5\")","v":"B5"}]
[null,{"$f":"IF($D$8=\"By Rows\",\"C11\",\"C5\")","v":"C5"}]
[null,{"$f":"IF($D$8=\"By Rows\",\"C12\",\"D5\")","v":"D5"}]
[null,{"$f":"IF($D$8=\"By Rows\",\"D1\",\"E5\")","v":"E5"}]
[null,{"$f":"IF($D$8=\"By Rows\",\"D2\",\"F5\")","v":"F5"}]
[null,{"$f":"IF($D$8=\"By Rows\",\"D3\",\"G5\")","v":"G5"}]
[null,{"$f":"IF($D$8=\"By Rows\",\"D4\",\"H5\")","v":"H5"}]
[null,{"$f":"IF($D$8=\"By Rows\",\"D5\",\"A6\")","v":"A6"}]
[null,{"$f":"IF($D$8=\"By Rows\",\"D6\",\"B6\")","v":"B6"}]
[null,{"$f":"IF($D$8=\"By Rows\",\"D7\",\"C6\")","v":"C6"}]
[null,{"$f":"IF($D$8=\"By Rows\",\"D8\",\"D6\")","v":"D6"}]
[null,{"$f":"IF($D$8=\"By Rows\",\"D9\",\"E6\")","v":"E6"}]
[null,{"$f":"IF($D$8=\"By Rows\",\"D10\",\"F6\")","v":"F6"}]
[null,{"$f":"IF($D$8=\"By Rows\",\"D11\",\"G6\")","v":"G6"}]
[null,{"$f":"IF($D$8=\"By Rows\",\"D12\",\"H6\")","v":"H6"}]
[null,{"$f":"IF($D$8=\"By Rows\",\"E1\",\"A7\")","v":"A7"}]
[null,{"$f":"IF($D$8=\"By Rows\",\"E2\",\"B7\")","v":"B7"}]
[null,{"$f":"IF($D$8=\"By Rows\",\"E3\",\"C7\")","v":"C7"}]
[null,{"$f":"IF($D$8=\"By Rows\",\"E4\",\"D7\")","v":"D7"}]
[null,{"$f":"IF($D$8=\"By Rows\",\"E5\",\"E7\")","v":"E7"}]
[null,{"$f":"IF($D$8=\"By Rows\",\"E6\",\"F7\")","v":"F7"}]
[null,{"$f":"IF($D$8=\"By Rows\",\"E7\",\"G7\")","v":"G7"}]
[null,{"$f":"IF($D$8=\"By Rows\",\"E8\",\"H7\")","v":"H7"}]
[null,{"$f":"IF($D$8=\"By Rows\",\"E9\",\"A8\")","v":"A8"}]
[null,{"$f":"IF($D$8=\"By Rows\",\"E10\",\"B8\")","v":"B8"}]
[null,{"$f":"IF($D$8=\"By Rows\",\"E11\",\"C8\")","v":"C8"}]
[null,{"$f":"IF($D$8=\"By Rows\",\"E12\",\"D8\")","v":"D8"}]
[null,{"$f":"IF($D$8=\"By Rows\",\"F1\",\"E8\")","v":"E8"}]
[null,{"$f":"IF($D$8=\"By Rows\",\"F2\",\"F8\")","v":"F8"}]
[null,{"$f":"IF($D$8=\"By Rows\",\"F3\",\"G8\")","v":"G8"}]
[null,{"$f":"IF($D$8=\"By Rows\",\"F4\",\"H8\")","v":"H8"}]
[null,{"$f":"IF($D$8=\"By Rows\",\"F5\",\"A9\")","v":"A9"}]
[null,{"$f":"IF($D$8=\"By Rows\",\"F6\",\"B9\")","v":"B9"}]
[null,{"$f":"IF($D$8=\"By Rows\",\"F7\",\"C9\")","v":"C9"}]
[null,{"$f":"IF($D$8=\"By Rows\",\"F8\",\"D9\")","v":"D9"}]
[null,{"$f":"IF($D$8=\"By Rows\",\"F9\",\"E9\")","v":"E9"}]
[null,{"$f":"IF($D$8=\"By Rows\",\"F10\",\"F9\")","v":"F9"}]
[null,{"$f":"IF($D$8=\"By Rows\",\"F11\",\"G9\")","v":"G9"}]
[null,{"$f":"IF($D$8=\"By Rows\",\"F12\",\"H9\")","v":"H9"}]
[null,{"$f":"IF($D$8=\"By Rows\",\"G1\",\"A10\")","v":"A10"}]
[null,{"$f":"IF($D$8=\"By Rows\",\"G2\",\"B10\")","v":"B10"}]
[null,{"$f":"IF($D$8=\"By Rows\",\"G3\",\"C10\")","v":"C10"}]
[null,{"$f":"IF($D$8=\"By Rows\",\"G4\",\"D10\")","v":"D10"}]
[null,{"$f":"IF($D$8=\"By Rows\",\"G5\",\"E10\")","v":"E10"}]
[null,{"$f":"IF($D$8=\"By Rows\",\"G6\",\"F10\")","v":"F10"}]
[null,{"$f":"IF($D$8=\"By Rows\",\"G7\",\"G10\")","v":"G10"}]
[null,{"$f":"IF($D$8=\"By Rows\",\"G8\",\"H10\")","v":"H10"}]
[null,{"$f":"IF($D$8=\"By Rows\",\"G9\",\"A11\")","v":"A11"}]
[null,{"$f":"IF($D$8=\"By Rows\",\"G10\",\"B11\")","v":"B11"}]
[null,{"$f":"IF($D$8=\"By Rows\",\"G11\",\"C11\")","v":"C11"}]
[null,{"$f":"IF($D$8=\"By Rows\",\"G12\",\"D11\")","v":"D11"}]
[null,{"$f":"IF($D$8=\"By Rows\",\"H1\",\"E11\")","v":"E11"}]
[null,{"$f":"IF($D$8=\"By Rows\",\"H2\",\"F11\")","v":"F11"}]
[null,{"$f":"IF($D$8=\"By Rows\",\"H3\",\"G11\")","v":"G11"}]
[null,{"$f":"IF($D$8=\"By Rows\",\"H4\",\"H11\")","v":"H11"}]
[null,{"$f":"IF($D$8=\"By Rows\",\"H5\",\"A12\")","v":"A12"}]
[null,{"$f":"IF($D$8=\"By Rows\",\"H6\",\"B12\")","v":"B12"}]
[null,{"$f":"IF($D$8=\"By Rows\",\"H7\",\"C12\")","v":"C12"}]
[null,{"$f":"IF($D$8=\"By Rows\",\"H8\",\"D12\")","v":"D12"}]
[null,{"$f":"IF($D$8=\"By Rows\",\"H9\",\"E12\")","v":"E12"}]
[null,{"$f":"IF($D$8=\"By Rows\",\"H10\",\"F12\")","v":"F12"}]
[null,{"$f":"IF($D$8=\"By Rows\",\"H11\",\"G12\")","v":"G12"}]
[null,"H12"]
[]
["We strongly recommend leaving the two reserved wells empty for internal quality control purposes. However, if you include your own samples in the reserved wells as well, we will not be able to evaluate the quality of the generated sequence data.",null,null,null,null,null,null,"© Eurofins Genomics"]

{"sheet":"Plate 19","index":21,"n_rows":110,"n_cols":11,"rows_kept":110,"cut":false,"hidden":false,"merged":[[1,6,1,7],[2,6,2,7],[3,6,3,7],[4,6,4,7],[109,0,112,6]]}
[]
[null,null,"Plate Information",null,null,"Tools ","Requirements"]
[null,null,"Plate Barcode:",null,null,null,"You must enter/select a primer name"]
[null,null,"*Sample Type:",null,null,"Help Page","Reserved for Control Samples"]
[null,null,"Add. Service:",null,null,null," *24 or more Samples/plate"]
[null,null,"*Advanced Options:","Standard"]
[null,null,"Template Specification:"]
[null,null,"*Plate Layout:","By Columns"]
[]
[]
[]
[null,"Well Position","*Sample Name","Primer 1","Sequence to synthesize or Barcode for enclosed primers","Primer 2","Sequence to synthesize or Barcode for enclosed primers","Primer 3","Sequence to synthesize or Barcode for enclosed primers","Primer 4","Sequence to synthesize or Barcode for enclosed primers"]
[null,"A1"]
[null,{"$f":"IF($D$8=\"By Rows\",\"A2\",\"B1\")","v":"B1"}]
[null,{"$f":"IF($D$8=\"By Rows\",\"A3\",\"C1\")","v":"C1"}]
[null,{"$f":"IF($D$8=\"By Rows\",\"A4\",\"D1\")","v":"D1"}]
[null,{"$f":"IF($D$8=\"By Rows\",\"A5\",\"E1\")","v":"E1"}]
[null,{"$f":"IF($D$8=\"By Rows\",\"A6\",\"F1\")","v":"F1"}]
[null,{"$f":"IF($D$8=\"By Rows\",\"A7\",\"G1\")","v":"G1"}]
[null,{"$f":"IF($D$8=\"By Rows\",\"A8\",\"H1\")","v":"H1"}]
[null,{"$f":"IF($D$8=\"By Rows\",\"A9\",\"A2\")","v":"A2"}]
[null,{"$f":"IF($D$8=\"By Rows\",\"A10\",\"B2\")","v":"B2"}]
[null,{"$f":"IF($D$8=\"By Rows\",\"A11\",\"C2\")","v":"C2"}]
[null,{"$f":"IF($D$8=\"By Rows\",\"A12\",\"D2\")","v":"D2"}]
[null,{"$f":"IF($D$8=\"By Rows\",\"B1\",\"E2\")","v":"E2"}]
[null,{"$f":"IF($D$8=\"By Rows\",\"B2\",\"F2\")","v":"F2"}]
[null,{"$f":"IF($D$8=\"By Rows\",\"B3\",\"G2\")","v":"G2"}]
[null,{"$f":"IF($D$8=\"By Rows\",\"B4\",\"H2\")","v":"H2"}]
[null,{"$f":"IF($D$8=\"By Rows\",\"B5\",\"A3\")","v":"A3"}]
[null,{"$f":"IF($D$8=\"By Rows\",\"B6\",\"B3\")","v":"B3"}]
[null,{"$f":"IF($D$8=\"By Rows\",\"B7\",\"C3\")","v":"C3"}]
[null,{"$f":"IF($D$8=\"By Rows\",\"B8\",\"D3\")","v":"D3"}]
[null,{"$f":"IF($D$8=\"By Rows\",\"B9\",\"E3\")","v":"E3"}]
[null,{"$f":"IF($D$8=\"By Rows\",\"B10\",\"F3\")","v":"F3"}]
[null,{"$f":"IF($D$8=\"By Rows\",\"B11\",\"G3\")","v":"G3"}]
[null,{"$f":"IF($D$8=\"By Rows\",\"B12\",\"H3\")","v":"H3"}]
[null,{"$f":"IF($D$8=\"By Rows\",\"C1\",\"A4\")","v":"A4"}]
[null,{"$f":"IF($D$8=\"By Rows\",\"C2\",\"B4\")","v":"B4"}]
[null,{"$f":"IF($D$8=\"By Rows\",\"C3\",\"C4\")","v":"C4"}]
[null,{"$f":"IF($D$8=\"By Rows\",\"C4\",\"D4\")","v":"D4"}]
[null,{"$f":"IF($D$8=\"By Rows\",\"C5\",\"E4\")","v":"E4"}]
[null,{"$f":"IF($D$8=\"By Rows\",\"C6\",\"F4\")","v":"F4"}]
[null,{"$f":"IF($D$8=\"By Rows\",\"C7\",\"G4\")","v":"G4"}]
[null,{"$f":"IF($D$8=\"By Rows\",\"C8\",\"H4\")","v":"H4"}]
[null,{"$f":"IF($D$8=\"By Rows\",\"C9\",\"A5\")","v":"A5"}]
[null,{"$f":"IF($D$8=\"By Rows\",\"C10\",\"B5\")","v":"B5"}]
[null,{"$f":"IF($D$8=\"By Rows\",\"C11\",\"C5\")","v":"C5"}]
[null,{"$f":"IF($D$8=\"By Rows\",\"C12\",\"D5\")","v":"D5"}]
[null,{"$f":"IF($D$8=\"By Rows\",\"D1\",\"E5\")","v":"E5"}]
[null,{"$f":"IF($D$8=\"By Rows\",\"D2\",\"F5\")","v":"F5"}]
[null,{"$f":"IF($D$8=\"By Rows\",\"D3\",\"G5\")","v":"G5"}]
[null,{"$f":"IF($D$8=\"By Rows\",\"D4\",\"H5\")","v":"H5"}]
[null,{"$f":"IF($D$8=\"By Rows\",\"D5\",\"A6\")","v":"A6"}]
[null,{"$f":"IF($D$8=\"By Rows\",\"D6\",\"B6\")","v":"B6"}]
[null,{"$f":"IF($D$8=\"By Rows\",\"D7\",\"C6\")","v":"C6"}]
[null,{"$f":"IF($D$8=\"By Rows\",\"D8\",\"D6\")","v":"D6"}]
[null,{"$f":"IF($D$8=\"By Rows\",\"D9\",\"E6\")","v":"E6"}]
[null,{"$f":"IF($D$8=\"By Rows\",\"D10\",\"F6\")","v":"F6"}]
[null,{"$f":"IF($D$8=\"By Rows\",\"D11\",\"G6\")","v":"G6"}]
[null,{"$f":"IF($D$8=\"By Rows\",\"D12\",\"H6\")","v":"H6"}]
[null,{"$f":"IF($D$8=\"By Rows\",\"E1\",\"A7\")","v":"A7"}]
[null,{"$f":"IF($D$8=\"By Rows\",\"E2\",\"B7\")","v":"B7"}]
[null,{"$f":"IF($D$8=\"By Rows\",\"E3\",\"C7\")","v":"C7"}]
[null,{"$f":"IF($D$8=\"By Rows\",\"E4\",\"D7\")","v":"D7"}]
[null,{"$f":"IF($D$8=\"By Rows\",\"E5\",\"E7\")","v":"E7"}]
[null,{"$f":"IF($D$8=\"By Rows\",\"E6\",\"F7\")","v":"F7"}]
[null,{"$f":"IF($D$8=\"By Rows\",\"E7\",\"G7\")","v":"G7"}]
[null,{"$f":"IF($D$8=\"By Rows\",\"E8\",\"H7\")","v":"H7"}]
[null,{"$f":"IF($D$8=\"By Rows\",\"E9\",\"A8\")","v":"A8"}]
[null,{"$f":"IF($D$8=\"By Rows\",\"E10\",\"B8\")","v":"B8"}]
[null,{"$f":"IF($D$8=\"By Rows\",\"E11\",\"C8\")","v":"C8"}]
[null,{"$f":"IF($D$8=\"By Rows\",\"E12\",\"D8\")","v":"D8"}]
[null,{"$f":"IF($D$8=\"By Rows\",\"F1\",\"E8\")","v":"E8"}]
[null,{"$f":"IF($D$8=\"By Rows\",\"F2\",\"F8\")","v":"F8"}]
[null,{"$f":"IF($D$8=\"By Rows\",\"F3\",\"G8\")","v":"G8"}]
[null,{"$f":"IF($D$8=\"By Rows\",\"F4\",\"H8\")","v":"H8"}]
[null,{"$f":"IF($D$8=\"By Rows\",\"F5\",\"A9\")","v":"A9"}]
[null,{"$f":"IF($D$8=\"By Rows\",\"F6\",\"B9\")","v":"B9"}]
[null,{"$f":"IF($D$8=\"By Rows\",\"F7\",\"C9\")","v":"C9"}]
[null,{"$f":"IF($D$8=\"By Rows\",\"F8\",\"D9\")","v":"D9"}]
[null,{"$f":"IF($D$8=\"By Rows\",\"F9\",\"E9\")","v":"E9"}]
[null,{"$f":"IF($D$8=\"By Rows\",\"F10\",\"F9\")","v":"F9"}]
[null,{"$f":"IF($D$8=\"By Rows\",\"F11\",\"G9\")","v":"G9"}]
[null,{"$f":"IF($D$8=\"By Rows\",\"F12\",\"H9\")","v":"H9"}]
[null,{"$f":"IF($D$8=\"By Rows\",\"G1\",\"A10\")","v":"A10"}]
[null,{"$f":"IF($D$8=\"By Rows\",\"G2\",\"B10\")","v":"B10"}]
[null,{"$f":"IF($D$8=\"By Rows\",\"G3\",\"C10\")","v":"C10"}]
[null,{"$f":"IF($D$8=\"By Rows\",\"G4\",\"D10\")","v":"D10"}]
[null,{"$f":"IF($D$8=\"By Rows\",\"G5\",\"E10\")","v":"E10"}]
[null,{"$f":"IF($D$8=\"By Rows\",\"G6\",\"F10\")","v":"F10"}]
[null,{"$f":"IF($D$8=\"By Rows\",\"G7\",\"G10\")","v":"G10"}]
[null,{"$f":"IF($D$8=\"By Rows\",\"G8\",\"H10\")","v":"H10"}]
[null,{"$f":"IF($D$8=\"By Rows\",\"G9\",\"A11\")","v":"A11"}]
[null,{"$f":"IF($D$8=\"By Rows\",\"G10\",\"B11\")","v":"B11"}]
[null,{"$f":"IF($D$8=\"By Rows\",\"G11\",\"C11\")","v":"C11"}]
[null,{"$f":"IF($D$8=\"By Rows\",\"G12\",\"D11\")","v":"D11"}]
[null,{"$f":"IF($D$8=\"By Rows\",\"H1\",\"E11\")","v":"E11"}]
[null,{"$f":"IF($D$8=\"By Rows\",\"H2\",\"F11\")","v":"F11"}]
[null,{"$f":"IF($D$8=\"By Rows\",\"H3\",\"G11\")","v":"G11"}]
[null,{"$f":"IF($D$8=\"By Rows\",\"H4\",\"H11\")","v":"H11"}]
[null,{"$f":"IF($D$8=\"By Rows\",\"H5\",\"A12\")","v":"A12"}]
[null,{"$f":"IF($D$8=\"By Rows\",\"H6\",\"B12\")","v":"B12"}]
[null,{"$f":"IF($D$8=\"By Rows\",\"H7\",\"C12\")","v":"C12"}]
[null,{"$f":"IF($D$8=\"By Rows\",\"H8\",\"D12\")","v":"D12"}]
[null,{"$f":"IF($D$8=\"By Rows\",\"H9\",\"E12\")","v":"E12"}]
[null,{"$f":"IF($D$8=\"By Rows\",\"H10\",\"F12\")","v":"F12"}]
[null,{"$f":"IF($D$8=\"By Rows\",\"H11\",\"G12\")","v":"G12"}]
[null,"H12"]
[]
["We strongly recommend leaving the two reserved wells empty for internal quality control purposes. However, if you include your own samples in the reserved wells as well, we will not be able to evaluate the quality of the generated sequence data.",null,null,null,null,null,null,"© Eurofins Genomics"]

{"sheet":"Plate 20","index":22,"n_rows":110,"n_cols":11,"rows_kept":110,"cut":false,"hidden":false,"merged":[[1,6,1,7],[2,6,2,7],[3,6,3,7],[4,6,4,7],[109,0,112,6]]}
[]
[null,null,"Plate Information",null,null,"Tools ","Requirements"]
[null,null,"Plate Barcode:",null,null,null,"You must enter/select a primer name"]
[null,null,"*Sample Type:",null,null,"Help Page","Reserved for Control Samples"]
[null,null,"Add. Service:",null,null,null," *24 or more Samples/plate"]
[null,null,"*Advanced Options:","Standard"]
[null,null,"Template Specification:"]
[null,null,"*Plate Layout:","By Columns"]
[]
[]
[]
[null,"Well Position","*Sample Name","Primer 1","Sequence to synthesize or Barcode for enclosed primers","Primer 2","Sequence to synthesize or Barcode for enclosed primers","Primer 3","Sequence to synthesize or Barcode for enclosed primers","Primer 4","Sequence to synthesize or Barcode for enclosed primers"]
[null,"A1"]
[null,{"$f":"IF($D$8=\"By Rows\",\"A2\",\"B1\")","v":"B1"}]
[null,{"$f":"IF($D$8=\"By Rows\",\"A3\",\"C1\")","v":"C1"}]
[null,{"$f":"IF($D$8=\"By Rows\",\"A4\",\"D1\")","v":"D1"}]
[null,{"$f":"IF($D$8=\"By Rows\",\"A5\",\"E1\")","v":"E1"}]
[null,{"$f":"IF($D$8=\"By Rows\",\"A6\",\"F1\")","v":"F1"}]
[null,{"$f":"IF($D$8=\"By Rows\",\"A7\",\"G1\")","v":"G1"}]
[null,{"$f":"IF($D$8=\"By Rows\",\"A8\",\"H1\")","v":"H1"}]
[null,{"$f":"IF($D$8=\"By Rows\",\"A9\",\"A2\")","v":"A2"}]
[null,{"$f":"IF($D$8=\"By Rows\",\"A10\",\"B2\")","v":"B2"}]
[null,{"$f":"IF($D$8=\"By Rows\",\"A11\",\"C2\")","v":"C2"}]
[null,{"$f":"IF($D$8=\"By Rows\",\"A12\",\"D2\")","v":"D2"}]
[null,{"$f":"IF($D$8=\"By Rows\",\"B1\",\"E2\")","v":"E2"}]
[null,{"$f":"IF($D$8=\"By Rows\",\"B2\",\"F2\")","v":"F2"}]
[null,{"$f":"IF($D$8=\"By Rows\",\"B3\",\"G2\")","v":"G2"}]
[null,{"$f":"IF($D$8=\"By Rows\",\"B4\",\"H2\")","v":"H2"}]
[null,{"$f":"IF($D$8=\"By Rows\",\"B5\",\"A3\")","v":"A3"}]
[null,{"$f":"IF($D$8=\"By Rows\",\"B6\",\"B3\")","v":"B3"}]
[null,{"$f":"IF($D$8=\"By Rows\",\"B7\",\"C3\")","v":"C3"}]
[null,{"$f":"IF($D$8=\"By Rows\",\"B8\",\"D3\")","v":"D3"}]
[null,{"$f":"IF($D$8=\"By Rows\",\"B9\",\"E3\")","v":"E3"}]
[null,{"$f":"IF($D$8=\"By Rows\",\"B10\",\"F3\")","v":"F3"}]
[null,{"$f":"IF($D$8=\"By Rows\",\"B11\",\"G3\")","v":"G3"}]
[null,{"$f":"IF($D$8=\"By Rows\",\"B12\",\"H3\")","v":"H3"}]
[null,{"$f":"IF($D$8=\"By Rows\",\"C1\",\"A4\")","v":"A4"}]
[null,{"$f":"IF($D$8=\"By Rows\",\"C2\",\"B4\")","v":"B4"}]
[null,{"$f":"IF($D$8=\"By Rows\",\"C3\",\"C4\")","v":"C4"}]
[null,{"$f":"IF($D$8=\"By Rows\",\"C4\",\"D4\")","v":"D4"}]
[null,{"$f":"IF($D$8=\"By Rows\",\"C5\",\"E4\")","v":"E4"}]
[null,{"$f":"IF($D$8=\"By Rows\",\"C6\",\"F4\")","v":"F4"}]
[null,{"$f":"IF($D$8=\"By Rows\",\"C7\",\"G4\")","v":"G4"}]
[null,{"$f":"IF($D$8=\"By Rows\",\"C8\",\"H4\")","v":"H4"}]
[null,{"$f":"IF($D$8=\"By Rows\",\"C9\",\"A5\")","v":"A5"}]
[null,{"$f":"IF($D$8=\"By Rows\",\"C10\",\"B5\")","v":"B5"}]
[null,{"$f":"IF($D$8=\"By Rows\",\"C11\",\"C5\")","v":"C5"}]
[null,{"$f":"IF($D$8=\"By Rows\",\"C12\",\"D5\")","v":"D5"}]
[null,{"$f":"IF($D$8=\"By Rows\",\"D1\",\"E5\")","v":"E5"}]
[null,{"$f":"IF($D$8=\"By Rows\",\"D2\",\"F5\")","v":"F5"}]
[null,{"$f":"IF($D$8=\"By Rows\",\"D3\",\"G5\")","v":"G5"}]
[null,{"$f":"IF($D$8=\"By Rows\",\"D4\",\"H5\")","v":"H5"}]
[null,{"$f":"IF($D$8=\"By Rows\",\"D5\",\"A6\")","v":"A6"}]
[null,{"$f":"IF($D$8=\"By Rows\",\"D6\",\"B6\")","v":"B6"}]
[null,{"$f":"IF($D$8=\"By Rows\",\"D7\",\"C6\")","v":"C6"}]
[null,{"$f":"IF($D$8=\"By Rows\",\"D8\",\"D6\")","v":"D6"}]
[null,{"$f":"IF($D$8=\"By Rows\",\"D9\",\"E6\")","v":"E6"}]
[null,{"$f":"IF($D$8=\"By Rows\",\"D10\",\"F6\")","v":"F6"}]
[null,{"$f":"IF($D$8=\"By Rows\",\"D11\",\"G6\")","v":"G6"}]
[null,{"$f":"IF($D$8=\"By Rows\",\"D12\",\"H6\")","v":"H6"}]
[null,{"$f":"IF($D$8=\"By Rows\",\"E1\",\"A7\")","v":"A7"}]
[null,{"$f":"IF($D$8=\"By Rows\",\"E2\",\"B7\")","v":"B7"}]
[null,{"$f":"IF($D$8=\"By Rows\",\"E3\",\"C7\")","v":"C7"}]
[null,{"$f":"IF($D$8=\"By Rows\",\"E4\",\"D7\")","v":"D7"}]
[null,{"$f":"IF($D$8=\"By Rows\",\"E5\",\"E7\")","v":"E7"}]
[null,{"$f":"IF($D$8=\"By Rows\",\"E6\",\"F7\")","v":"F7"}]
[null,{"$f":"IF($D$8=\"By Rows\",\"E7\",\"G7\")","v":"G7"}]
[null,{"$f":"IF($D$8=\"By Rows\",\"E8\",\"H7\")","v":"H7"}]
[null,{"$f":"IF($D$8=\"By Rows\",\"E9\",\"A8\")","v":"A8"}]
[null,{"$f":"IF($D$8=\"By Rows\",\"E10\",\"B8\")","v":"B8"}]
[null,{"$f":"IF($D$8=\"By Rows\",\"E11\",\"C8\")","v":"C8"}]
[null,{"$f":"IF($D$8=\"By Rows\",\"E12\",\"D8\")","v":"D8"}]
[null,{"$f":"IF($D$8=\"By Rows\",\"F1\",\"E8\")","v":"E8"}]
[null,{"$f":"IF($D$8=\"By Rows\",\"F2\",\"F8\")","v":"F8"}]
[null,{"$f":"IF($D$8=\"By Rows\",\"F3\",\"G8\")","v":"G8"}]
[null,{"$f":"IF($D$8=\"By Rows\",\"F4\",\"H8\")","v":"H8"}]
[null,{"$f":"IF($D$8=\"By Rows\",\"F5\",\"A9\")","v":"A9"}]
[null,{"$f":"IF($D$8=\"By Rows\",\"F6\",\"B9\")","v":"B9"}]
[null,{"$f":"IF($D$8=\"By Rows\",\"F7\",\"C9\")","v":"C9"}]
[null,{"$f":"IF($D$8=\"By Rows\",\"F8\",\"D9\")","v":"D9"}]
[null,{"$f":"IF($D$8=\"By Rows\",\"F9\",\"E9\")","v":"E9"}]
[null,{"$f":"IF($D$8=\"By Rows\",\"F10\",\"F9\")","v":"F9"}]
[null,{"$f":"IF($D$8=\"By Rows\",\"F11\",\"G9\")","v":"G9"}]
[null,{"$f":"IF($D$8=\"By Rows\",\"F12\",\"H9\")","v":"H9"}]
[null,{"$f":"IF($D$8=\"By Rows\",\"G1\",\"A10\")","v":"A10"}]
[null,{"$f":"IF($D$8=\"By Rows\",\"G2\",\"B10\")","v":"B10"}]
[null,{"$f":"IF($D$8=\"By Rows\",\"G3\",\"C10\")","v":"C10"}]
[null,{"$f":"IF($D$8=\"By Rows\",\"G4\",\"D10\")","v":"D10"}]
[null,{"$f":"IF($D$8=\"By Rows\",\"G5\",\"E10\")","v":"E10"}]
[null,{"$f":"IF($D$8=\"By Rows\",\"G6\",\"F10\")","v":"F10"}]
[null,{"$f":"IF($D$8=\"By Rows\",\"G7\",\"G10\")","v":"G10"}]
[null,{"$f":"IF($D$8=\"By Rows\",\"G8\",\"H10\")","v":"H10"}]
[null,{"$f":"IF($D$8=\"By Rows\",\"G9\",\"A11\")","v":"A11"}]
[null,{"$f":"IF($D$8=\"By Rows\",\"G10\",\"B11\")","v":"B11"}]
[null,{"$f":"IF($D$8=\"By Rows\",\"G11\",\"C11\")","v":"C11"}]
[null,{"$f":"IF($D$8=\"By Rows\",\"G12\",\"D11\")","v":"D11"}]
[null,{"$f":"IF($D$8=\"By Rows\",\"H1\",\"E11\")","v":"E11"}]
[null,{"$f":"IF($D$8=\"By Rows\",\"H2\",\"F11\")","v":"F11"}]
[null,{"$f":"IF($D$8=\"By Rows\",\"H3\",\"G11\")","v":"G11"}]
[null,{"$f":"IF($D$8=\"By Rows\",\"H4\",\"H11\")","v":"H11"}]
[null,{"$f":"IF($D$8=\"By Rows\",\"H5\",\"A12\")","v":"A12"}]
[null,{"$f":"IF($D$8=\"By Rows\",\"H6\",\"B12\")","v":"B12"}]
[null,{"$f":"IF($D$8=\"By Rows\",\"H7\",\"C12\")","v":"C12"}]
[null,{"$f":"IF($D$8=\"By Rows\",\"H8\",\"D12\")","v":"D12"}]
[null,{"$f":"IF($D$8=\"By Rows\",\"H9\",\"E12\")","v":"E12"}]
[null,{"$f":"IF($D$8=\"By Rows\",\"H10\",\"F12\")","v":"F12"}]
[null,{"$f":"IF($D$8=\"By Rows\",\"H11\",\"G12\")","v":"G12"}]
[null,"H12"]
[]
["We strongly recommend leaving the two reserved wells empty for internal quality control purposes. However, if you include your own samples in the reserved wells as well, we will not be able to evaluate the quality of the generated sequence data.",null,null,null,null,null,null,"© Eurofins Genomics"]

{"sheet":"DropData","index":23,"n_rows":130,"n_cols":6,"rows_kept":130,"cut":false,"hidden":true,"merged":[]}
[null,null,"Select Primer or Enter name"]
["Sample Type",null,"Premixed","Yes"]
[null,null,"16F","Yes"]
["Plasmids",null,"16R","Yes"]
["PCR Products",null,"3AOX","Yes"]
["Mix of Both",null,"5AOX","Yes"]
[null,null,"96gIII","Yes"]
[null,null,"BGHrev","Yes"]
["Sample Specification",null,"CMVf","Yes"]
[null,null,"CYC1Reverse","Yes"]
["Premixed",null,"EF-1aForward","Yes"]
[null,null,"EGFPC1F","Yes"]
[null,null,"EGFPC1R","Yes"]
["Add. Service",null,"EGFPN1F","Yes"]
[null,null,"EGFPN1R","Yes"]
["DNA Preparation",null,"GadFor","Yes"]
["PCR Purification",null,"GadRev","Yes"]
[null,null,"Gal4AD","Yes"]
[null,null,"Gal4BD","Yes"]
["Advanced Option:",null,"GAPSEQF","Yes"]
["Standard",null,"GAPSEQR","Yes"]
["Power Read",null,"GL2","Yes"]
[null,null,"ITS1","Yes"]
["Template Specification:",null,"ITS4","Yes"]
[null,null,"M1396","Yes"]
["Standard",null,"M13F","Yes"]
["GC or GT Rich",null,"M13F43","Yes"]
["2° Structure",null,"M13R","Yes"]
["shRNA construct",null,"M13R49","Yes"]
["Repeats",null,"malE","Yes"]
["Other",null,"mCherry-F","Yes"]
[null,null,"mCherry-R","Yes"]
["By Columns",null,"Myc","Yes"]
["By Rows",null,"pBabe3","Yes"]
[null,null,"pBabe5","Yes"]
[null,null,"pBabeF","Yes"]
[null,null,"pBabeR","Yes"]
[null,null,"pBadF","Yes"]
[null,null,"pBadR","Yes"]
[null,null,"pcDNAF","Yes"]
[null,null,"pcDNAR","Yes"]
[null,null,"petup","Yes"]
[null,null,"pexF","Yes"]
[null,null,"pexR","Yes"]
[null,null,"pFBACf","Yes"]
[null,null,"pFBACr","Yes"]
[null,null,"pGexF","Yes"]
[null,null,"pGexR","Yes"]
[null,null,"pGL3for","Yes"]
[null,null,"pGLfor","Yes"]
[null,null,"pGLrev","Yes"]
[null,null,"pJET12F","Yes"]
[null,null,"pJET12R","Yes"]
[null,null,"pJET1F","Yes"]
[null,null,"pJET1R","Yes"]
[null,null,"pJETSEQF","Yes"]
[null,null,"pJETSEQR","Yes"]
[null,null,"pQEfPR","Yes"]
[null,null,"pQErev","Yes"]
[null,null,"pShCMVf","Yes"]
[null,null,"pShCMVr","Yes"]
[null,null,"RV3","Yes"]
[null,null,"SeqL-A","Yes"]
[null,null,"SeqL-B","Yes"]
[null,null,"SP6","Yes"]
[null,null,"SV40pA-R","Yes"]
[null,null,"SV40-promoter","Yes"]
[null,null,"T3","Yes"]
[null,null,"T7","Yes"]
[null,null,"T7EEV","Yes"]
[null,null,"T7PCS2","Yes"]
[null,null,"T7term","Yes"]
[null,null,"TrcHisF","Yes"]
[null,null,"TrcHisR","Yes"]
[null,null,"V1-5","Yes"]
["Reaction Chemistry",null,"V5","Yes"]
[null,null,"VF2","Yes"]
["Standard, DNA Read",null,"VR","Yes"]
[null,null,"XL39","Yes"]
["Template Size"]
[]
["Template Specification"]
[]
["GC/GT Rich"]
["Secondary Structure"]
["shRNA Construct"]
["Repeats"]
["Other"]
[]
["Premixed?"]
[]
["Yes"]
["No"]
[]
[]
["Power Reads?"]
[]
["Yes"]
["No"]
[]
[]
[]
["# of samples","Plate 1",null,"Plate 3","Plate 4","Plate 5"]
[null,{"$f":"COUNTA(#REF!)","v":1},"Plate 2",{"$f":"COUNTA(#REF!)","v":1},{"$f":"COUNTA(#REF!)","v":1},{"$f":"COUNTA(#REF!)","v":1}]
[null,null,{"$f":"COUNTA(#REF!)","v":1}]
[null,"Plate 6",null,"Plate 8","Plate 9","Plate 10"]
[null,{"$f":"COUNTA(#REF!)","v":1},"Plate 7",{"$f":"COUNTA(#REF!)","v":1},{"$f":"COUNTA(#REF!)","v":1},{"$f":"COUNTA(#REF!)","v":1}]
[null,null,{"$f":"COUNTA(#REF!)","v":1}]
[null,"Plate 11",null,"Plate 13","Plate 14","Plate 15"]
[null,{"$f":"COUNTA(#REF!)","v":1},"Plate 12",{"$f":"COUNTA(#REF!)","v":1},{"$f":"COUNTA(#REF!)","v":1},{"$f":"COUNTA(#REF!)","v":1}]
[null,null,{"$f":"COUNTA(#REF!)","v":1}]
[null,"Plate 16",null,"Plate 18","Plate 19","Plate 20"]
[null,{"$f":"COUNTA(#REF!)","v":1},"Plate 17",{"$f":"COUNTA(#REF!)","v":1},{"$f":"COUNTA(#REF!)","v":1},{"$f":"COUNTA(#REF!)","v":1}]
[null,null,{"$f":"COUNTA(#REF!)","v":1}]
[]
[]
[]
[]
["# of reactions","Plate 1",null,"Plate 3","Plate 4","Plate 5"]
[null,{"$f":"COUNTA('Plate 08'!$D$13:$D$106,#REF!,#REF!,#REF!)","v":3},"Plate 2",{"$f":"COUNTA(#REF!,#REF!,#REF!,#REF!)","v":4},{"$f":"COUNTA(#REF!,#REF!,#REF!,#REF!)","v":4},{"$f":"COUNTA(#REF!,#REF!,#REF!,#REF!)","v":4}]
[null,null,{"$f":"COUNTA(#REF!,#REF!,#REF!,#REF!)","v":4}]
[null,"Plate 6",null,"Plate 8","Plate 9","Plate 10"]
[null,{"$f":"COUNTA(#REF!,#REF!,#REF!,#REF!)","v":4},"Plate 7",{"$f":"COUNTA(#REF!,#REF!,#REF!,#REF!)","v":4},{"$f":"COUNTA(#REF!,#REF!,#REF!,#REF!)","v":4},{"$f":"COUNTA(#REF!,#REF!,#REF!,#REF!)","v":4}]
[null,null,{"$f":"COUNTA(#REF!,#REF!,#REF!,#REF!)","v":4}]
[null,"Plate 11",null,"Plate 13","Plate 14","Plate 15"]
[null,{"$f":"COUNTA(#REF!,#REF!,#REF!,#REF!)","v":4},"Plate 12",{"$f":"COUNTA(#REF!,#REF!,#REF!,#REF!)","v":4},{"$f":"COUNTA(#REF!,#REF!,#REF!,#REF!)","v":4},{"$f":"COUNTA(#REF!,#REF!,#REF!,#REF!)","v":4}]
[null,null,{"$f":"COUNTA(#REF!,#REF!,#REF!,#REF!)","v":4}]
[null,"Plate 16",null,"Plate 18","Plate 19","Plate 20"]
[null,{"$f":"COUNTA(#REF!,#REF!,#REF!,#REF!)","v":4},"Plate 17",{"$f":"COUNTA(#REF!,#REF!,#REF!,#REF!)","v":4},{"$f":"COUNTA(#REF!,#REF!,#REF!,#REF!)","v":4},{"$f":"COUNTA(#REF!,#REF!,#REF!,#REF!)","v":4}]
[null,null,{"$f":"COUNTA(#REF!,#REF!,#REF!,#REF!)","v":4}]